BDBM51738 3-[[2-(4-methoxyphenyl)-6-methyl-1-benzopyran-4-ylidene]amino]propanoic acid;perchloric acid::3-[[2-(4-methoxyphenyl)-6-methyl-chromen-4-ylidene]amino]propanoic acid;perchloric acid::3-[[2-(4-methoxyphenyl)-6-methyl-chromen-4-ylidene]amino]propionic acid;perchloric acid::3-[[2-(4-methoxyphenyl)-6-methylchromen-4-ylidene]amino]propanoic acid;perchloric acid::MLS000775780::SMR000369345::cid_16196274
SMILES COc1ccc(cc1)-c1c\c(=N/CCC(O)=O)c2cc(C)ccc2o1
InChI Key InChIKey=BVDICSMRGRBKKK-HEHNFIMWSA-N
Data  2 IC50
  Tab Delimited (TSV)   2D SDfile   Computed 3D by Vconf -m prep SDfile
Find this compound or compounds like it in BindingDB:
Activity Spreadsheet -- Enzyme Inhibition Constant Data from BindingDB
Found 2 hits for monomerid = 51738
TargetM1 family aminopeptidase(Plasmodium falciparum (isolate FcB1 / Columbia))
Srmlsc
Curated by PubChem BioAssay
LigandPNGBDBM51738(3-[[2-(4-methoxyphenyl)-6-methyl-1-benzopyran-4-yl...)
Affinity DataIC50:  3.89E+4nM. Assay description: Southern Research Molecular Libraries Screening Center (SRMLSC) Southern Research Institute (Birmingham, Alabama) NIH Molecular Libraries Screening...
In DepthDetails PCBioAssay
TargetdTDP-4-dehydrorhamnose 3,5-epimerase(Mycobacterium tuberculosis H37Rv)
Pcmd
Curated by PubChem BioAssay
LigandPNGBDBM51738(3-[[2-(4-methoxyphenyl)-6-methyl-1-benzopyran-4-yl...)
Affinity DataIC50:  597nM. Assay description: Molecular Library Screening Center Network (MLSCN) Penn Center for Molecular Discovery (PCMD) Assay Provider: Michael McNeil, Colorado State Universi...
In DepthDetails PCBioAssay