BDBM51848 5-bromanyl-N-[2-(2-methylindol-1-yl)ethyl]furan-2-carboxamide::5-bromo-N-[2-(2-methyl-1-indolyl)ethyl]-2-furancarboxamide::5-bromo-N-[2-(2-methylindol-1-yl)ethyl]-2-furamide::5-bromo-N-[2-(2-methylindol-1-yl)ethyl]furan-2-carboxamide::MLS000419204::SMR000319895::cid_4321221
SMILES Cc1cc2ccccc2n1CCNC(=O)c1ccc(Br)o1
InChI Key InChIKey=WEKYVNZJKJRZGI-UHFFFAOYSA-N
Data  2 EC50
  Tab Delimited (TSV)   2D SDfile   Computed 3D by Vconf -m prep SDfile
Find this compound or compounds like it in BindingDB:
Activity Spreadsheet -- Enzyme Inhibition Constant Data from BindingDB
Found 2 hits for monomerid = 51848
LigandPNGBDBM51848(5-bromanyl-N-[2-(2-methylindol-1-yl)ethyl]furan-2-...)
Affinity DataEC50:  3.48E+3nM. Assay description: University of New Mexico Assay Overview: Assay Support: 1R03MH084830-01 Project Title: TR-FRET HTS Assay for Inhibitors of MEKK2-MEK5 PB1 Domain...
In DepthDetails PCBioAssay
LigandPNGBDBM51848(5-bromanyl-N-[2-(2-methylindol-1-yl)ethyl]furan-2-...)
Affinity DataEC50:  2.92E+3nM. Assay description: University of New Mexico Assay Overview: Assay Support: 1R03MH084830-01 Project Title: TR-FRET HTS Assay for Inhibitors of MEKK2-MEK5 PB1 Domain...
In DepthDetails PCBioAssay