BDBM51931 MLS001105226::SMR000658721::[(1S,4S)-3-azabicyclo[2.2.1]heptan-3-yl]-[5-[(2,6-difluorophenoxy)methyl]-1,2-oxazol-3-yl]methanone::[(1S,4S)-3-azabicyclo[2.2.1]heptan-3-yl]-[5-[(2,6-difluorophenoxy)methyl]-3-isoxazolyl]methanone::[(1S,4S)-3-azabicyclo[2.2.1]heptan-3-yl]-[5-[(2,6-difluorophenoxy)methyl]isoxazol-3-yl]methanone::[(1S,4S)-3-azabicyclo[2.2.1]heptan-3-yl]-[5-[[2,6-bis(fluoranyl)phenoxy]methyl]-1,2-oxazol-3-yl]methanone::cid_24794069
SMILES Fc1cccc(F)c1OCc1cc(no1)C(=O)N1C[C@H]2CC[C@H]1C2
InChI Key InChIKey=MWHJXOAVSCUJNE-QWRGUYRKSA-N
Data  2 EC50
  Tab Delimited (TSV)   2D SDfile   Computed 3D by Vconf -m prep SDfile
Find this compound or compounds like it in BindingDB:
Activity Spreadsheet -- Enzyme Inhibition Constant Data from BindingDB
Found 2 hits for monomerid = 51931
LigandPNGBDBM51931(MLS001105226 | SMR000658721 | [(1S,4S)-3-azabicycl...)
Affinity DataEC50:  3.00E+4nM. Assay description: University of New Mexico Assay Overview: Assay Support: 1R03MH084830-01 Project Title: TR-FRET HTS Assay for Inhibitors of MEKK2-MEK5 PB1 Domain...
In DepthDetails PCBioAssay
LigandPNGBDBM51931(MLS001105226 | SMR000658721 | [(1S,4S)-3-azabicycl...)
Affinity DataEC50:  3.00E+4nM. Assay description: University of New Mexico Assay Overview: Assay Support: 1R03MH084830-01 Project Title: TR-FRET HTS Assay for Inhibitors of MEKK2-MEK5 PB1 Domain...
In DepthDetails PCBioAssay