BDBM51966 3-cyclopropyl-4-(2-furanylmethyl)-1H-1,2,4-triazole-5-thione::3-cyclopropyl-4-(2-furfuryl)-1H-1,2,4-triazole-5-thione::3-cyclopropyl-4-(furan-2-ylmethyl)-1H-1,2,4-triazole-5-thione::MLS000565162::SMR000152420::cid_2470561
SMILES S=c1[nH]nc(C2CC2)n1Cc1ccco1
InChI Key InChIKey=YXIWUVAHHVRXPH-UHFFFAOYSA-N
Data  4 IC50
  Tab Delimited (TSV)   2D SDfile   Computed 3D by Vconf -m prep SDfile
Find this compound or compounds like it in BindingDB:
Activity Spreadsheet -- Enzyme Inhibition Constant Data from BindingDB
Found 4 hits for monomerid = 51966
TargetBeta-lactamase(Pseudomonas aeruginosa)
The Scripps Research Institute Molecular Screening Center
Curated by PubChem BioAssay
LigandPNGBDBM51966(3-cyclopropyl-4-(2-furanylmethyl)-1H-1,2,4-triazol...)
Affinity DataIC50:  9.32E+3nM. Assay description: Source (MLPCN Center Name): The Scripps Research Institute Molecular Screening Center (SRIMSC) Center Affiliation: The Scripps Research Institute (TS...
In DepthDetails PCBioAssay
TargetBeta-lactamase(Pseudomonas aeruginosa)
The Scripps Research Institute Molecular Screening Center
Curated by PubChem BioAssay
LigandPNGBDBM51966(3-cyclopropyl-4-(2-furanylmethyl)-1H-1,2,4-triazol...)
Affinity DataIC50:  5.96E+4nM. Assay description: Source (MLPCN Center Name): The Scripps Research Institute Molecular Screening Center (SRIMSC) Center Affiliation: The Scripps Research Institute (TS...
In DepthDetails PCBioAssay
TargetBeta-lactamase(Pseudomonas aeruginosa)
The Scripps Research Institute Molecular Screening Center
Curated by PubChem BioAssay
LigandPNGBDBM51966(3-cyclopropyl-4-(2-furanylmethyl)-1H-1,2,4-triazol...)
Affinity DataIC50:  3.76E+3nM. Assay description: Source (MLPCN Center Name): The Scripps Research Institute Molecular Screening Center (SRIMSC) Center Affiliation: The Scripps Research Institute (TS...
In DepthDetails PCBioAssay
TargetBeta-lactamase(Pseudomonas aeruginosa)
The Scripps Research Institute Molecular Screening Center
Curated by PubChem BioAssay
LigandPNGBDBM51966(3-cyclopropyl-4-(2-furanylmethyl)-1H-1,2,4-triazol...)
Affinity DataIC50:  5.96E+4nM. Assay description: Source (MLPCN Center Name): The Scripps Research Institute Molecular Screening Center (SRIMSC) Center Affiliation: The Scripps Research Institute (TS...
In DepthDetails PCBioAssay