BDBM52248 4-[5-chloro-3-(5-methyl-2-furanyl)-2-benzofuranyl]-2-butanone oxime::4-[5-chloro-3-(5-methyl-2-furyl)-1-benzofuran-2-yl]-2-butanone oxime::4-[5-chloro-3-(5-methyl-2-furyl)benzofuran-2-yl]butan-2-one oxime::MLS000549059::N-[4-[5-chloranyl-3-(5-methylfuran-2-yl)-1-benzofuran-2-yl]butan-2-ylidene]hydroxylamine::N-[4-[5-chloro-3-(5-methylfuran-2-yl)-1-benzofuran-2-yl]butan-2-ylidene]hydroxylamine::SMR000114370::cid_799493
SMILES CC(CCc1oc2ccc(Cl)cc2c1-c1ccc(C)o1)N=O
InChI Key InChIKey=ZETZYWYOIKLXNM-UHFFFAOYSA-N
Data  2 EC50
  Tab Delimited (TSV)   2D SDfile   Computed 3D by Vconf -m prep SDfile
Find this compound or compounds like it in BindingDB:
Activity Spreadsheet -- Enzyme Inhibition Constant Data from BindingDB
Found 2 hits for monomerid = 52248
TargetZinc finger protein mex-5(Caenorhabditis elegans)
Broad Institute
Curated by PubChem BioAssay
LigandPNGBDBM52248(4-[5-chloro-3-(5-methyl-2-furanyl)-2-benzofuranyl]...)
Affinity DataEC50:  3.00E+5nM. Assay description: Broad Institute: MLPCN maternal gene expression Project ID: 2024 Keywords: Zinc finger, C. elegans, maternal gene expression, RNA-protein interac...
In DepthDetails PCBioAssay
TargetPOsterior Segregation(Caenorhabditis elegans)
Broad Institute
Curated by PubChem BioAssay
LigandPNGBDBM52248(4-[5-chloro-3-(5-methyl-2-furanyl)-2-benzofuranyl]...)
Affinity DataEC50:  3.00E+5nM. Assay description: Broad Institute: MLPCN maternal gene expression Project ID: 2024 Keywords: Zinc finger, C. elegans, maternal gene expression, RNA-protein interac...
In DepthDetails PCBioAssay