BDBM52311 6-amino-4-(3-bromo-4-hydroxy-5-methoxy-phenyl)-3-(3-pyridyl)-2,4-dihydropyrano[2,3-c]pyrazole-5-carbonitrile::6-amino-4-(3-bromo-4-hydroxy-5-methoxyphenyl)-3-(3-pyridinyl)-1,4-dihydropyrano[2,3-c]pyrazole-5-carbonitrile::6-amino-4-(3-bromo-4-hydroxy-5-methoxyphenyl)-3-(3-pyridinyl)-2,4-dihydropyrano[2,3-c]pyrazole-5-carbonitrile::6-amino-4-(3-bromo-4-hydroxy-5-methoxyphenyl)-3-pyridin-3-yl-2,4-dihydropyrano[2,3-c]pyrazole-5-carbonitrile::6-azanyl-4-(3-bromanyl-5-methoxy-4-oxidanyl-phenyl)-3-pyridin-3-yl-2,4-dihydropyrano[2,3-c]pyrazole-5-carbonitrile::MLS000547469::SMR000113472::cid_4426892
SMILES COc1cc(cc(Br)c1O)C1C(C#N)C(=N)Oc2[nH]nc(c12)-c1cccnc1
InChI Key InChIKey=GKXFFEZAFGYALY-UHFFFAOYSA-N
Data  2 EC50
  Tab Delimited (TSV)   2D SDfile   Computed 3D by Vconf -m prep SDfile
Find this compound or compounds like it in BindingDB:
Activity Spreadsheet -- Enzyme Inhibition Constant Data from BindingDB
Found 2 hits for monomerid = 52311
TargetZinc finger protein mex-5(Caenorhabditis elegans)
Broad Institute
Curated by PubChem BioAssay
LigandPNGBDBM52311(6-amino-4-(3-bromo-4-hydroxy-5-methoxy-phenyl)-3-(...)
Affinity DataEC50:  3.00E+5nM. Assay description: Broad Institute: MLPCN maternal gene expression Project ID: 2024 Keywords: Zinc finger, C. elegans, maternal gene expression, RNA-protein interac...
In DepthDetails PCBioAssay
TargetPOsterior Segregation(Caenorhabditis elegans)
Broad Institute
Curated by PubChem BioAssay
LigandPNGBDBM52311(6-amino-4-(3-bromo-4-hydroxy-5-methoxy-phenyl)-3-(...)
Affinity DataEC50:  3.00E+5nM. Assay description: Broad Institute: MLPCN maternal gene expression Project ID: 2024 Keywords: Zinc finger, C. elegans, maternal gene expression, RNA-protein interac...
In DepthDetails PCBioAssay