BDBM52321 (Z)-2-keto-4-(1-naphthyl)-3-(2-quinolyl)but-3-enoic acid::(Z)-4-(1-naphthalenyl)-2-oxo-3-(2-quinolinyl)-3-butenoic acid::(Z)-4-naphthalen-1-yl-2-oxidanylidene-3-quinolin-2-yl-but-3-enoic acid::(Z)-4-naphthalen-1-yl-2-oxo-3-quinolin-2-ylbut-3-enoic acid::MLS000570120::SMR000150131::cid_6296456
SMILES OC(=O)C(=O)C(=C/c1cccc2ccccc12)\c1ccc2ccccc2n1
InChI Key InChIKey=GIQGCIWBMMAIEN-RGEXLXHISA-N
Data  3 EC50
  Tab Delimited (TSV)   2D SDfile   Computed 3D by Vconf -m prep SDfile
Find this compound or compounds like it in BindingDB:
Activity Spreadsheet -- Enzyme Inhibition Constant Data from BindingDB
Found 3 hits for monomerid = 52321
TargetPOsterior Segregation(Caenorhabditis elegans)
Broad Institute
Curated by PubChem BioAssay
LigandPNGBDBM52321((Z)-2-keto-4-(1-naphthyl)-3-(2-quinolyl)but-3-enoi...)
Affinity DataEC50:  1.64E+5nM. Assay description: Broad Institute: MLPCN maternal gene expression Project ID: 2024 Keywords: Zinc finger, C. elegans, maternal gene expression, RNA-protein interac...
In DepthDetails PCBioAssay
TargetCorticotropin-releasing factor-binding protein(Homo sapiens (Human))
Burnham Center For Chemical Genomics
Curated by PubChem BioAssay
LigandPNGBDBM52321((Z)-2-keto-4-(1-naphthyl)-3-(2-quinolyl)but-3-enoi...)
Affinity DataEC50:  7.60E+3nM. Assay description: Data Source: Sanford-Burnham Center for Chemical Genomics (SBCCG) Source Affiliation: Sanford-Burnham Medical Research Institute (SBMRI, San Diego, C...
In DepthDetails PCBioAssay
TargetZinc finger protein mex-5(Caenorhabditis elegans)
Broad Institute
Curated by PubChem BioAssay
LigandPNGBDBM52321((Z)-2-keto-4-(1-naphthyl)-3-(2-quinolyl)but-3-enoi...)
Affinity DataEC50:  3.42E+4nM. Assay description: Broad Institute: MLPCN maternal gene expression Project ID: 2024 Keywords: Zinc finger, C. elegans, maternal gene expression, RNA-protein interac...
In DepthDetails PCBioAssay