BDBM52326 (E)-2-cyano-N-(2,6-dimethylphenyl)-3-(5-methyl-2-thienyl)acrylamide::(E)-2-cyano-N-(2,6-dimethylphenyl)-3-(5-methyl-2-thiophenyl)-2-propenamide::(E)-2-cyano-N-(2,6-dimethylphenyl)-3-(5-methylthiophen-2-yl)prop-2-enamide::MLS000564668::SMR000149945::cid_2346696
SMILES Cc1ccc(\C=C(/C#N)C(=O)Nc2c(C)cccc2C)s1
InChI Key InChIKey=IZOBYAFWYHXWLU-NTEUORMPSA-N
Data  2 IC50  2 EC50
  Tab Delimited (TSV)   2D SDfile   Computed 3D by Vconf -m prep SDfile
Find this compound or compounds like it in BindingDB:
Activity Spreadsheet -- Enzyme Inhibition Constant Data from BindingDB
Found 4 hits for monomerid = 52326
TargetPOsterior Segregation(Caenorhabditis elegans)
Broad Institute
Curated by PubChem BioAssay
LigandPNGBDBM52326((E)-2-cyano-N-(2,6-dimethylphenyl)-3-(5-methyl-2-t...)
Affinity DataEC50:  3.00E+5nM. Assay description: Broad Institute: MLPCN maternal gene expression Project ID: 2024 Keywords: Zinc finger, C. elegans, maternal gene expression, RNA-protein interac...
In DepthDetails PCBioAssay
Target26S proteasome non-ATPase regulatory subunit 14(Homo sapiens (Human))
Burnham Center For Chemical Genomics
Curated by PubChem BioAssay
LigandPNGBDBM52326((E)-2-cyano-N-(2,6-dimethylphenyl)-3-(5-methyl-2-t...)
Affinity DataIC50:  1.35E+4nM. Assay description: Data Source: Sanford-Burnham Center for Chemical Genomics (SBCCG) Source Affiliation: Sanford Burnham Medical Research Institute (SBMRI, La Jolla, CA...
In DepthDetails PCBioAssay
TargetProthrombin(Bos taurus (Bovine))
Burnham Center For Chemical Genomics
Curated by PubChem BioAssay
LigandPNGBDBM52326((E)-2-cyano-N-(2,6-dimethylphenyl)-3-(5-methyl-2-t...)
Affinity DataIC50:  2.35E+4nM. Assay description: Data Source: Sanford-Burnham Center for Chemical Genomics (SBCCG) Source Affiliation: Sanford Burnham Medical Research Institute (SBMRI, La Jolla, CA...
In DepthDetails PCBioAssay
TargetZinc finger protein mex-5(Caenorhabditis elegans)
Broad Institute
Curated by PubChem BioAssay
LigandPNGBDBM52326((E)-2-cyano-N-(2,6-dimethylphenyl)-3-(5-methyl-2-t...)
Affinity DataEC50:  3.00E+5nM. Assay description: Broad Institute: MLPCN maternal gene expression Project ID: 2024 Keywords: Zinc finger, C. elegans, maternal gene expression, RNA-protein interac...
In DepthDetails PCBioAssay