BDBM52863 6-Oxo-1,6-dihydro-pyridazine-3-carboxylic acid [1-(2-hydroxy-3-methoxy-phenyl)-meth-(E)-ylidene]-hydrazide::6-keto-N'-[(E)-(6-keto-5-methoxy-cyclohexa-2,4-dien-1-ylidene)methyl]-1H-pyridazine-3-carbohydrazide::MLS000777445::N'-[(E)-(5-methoxy-6-oxidanylidene-cyclohexa-2,4-dien-1-ylidene)methyl]-6-oxidanylidene-1H-pyridazine-3-carbohydrazide::N'-[(E)-(5-methoxy-6-oxo-1-cyclohexa-2,4-dienylidene)methyl]-6-oxo-1H-pyridazine-3-carbohydrazide::N'-[(E)-(5-methoxy-6-oxocyclohexa-2,4-dien-1-ylidene)methyl]-6-oxo-1H-pyridazine-3-carbohydrazide::SMR000413839::cid_5424318
SMILES COc1cccc(C=NNC(=O)c2ccc(=O)[nH]n2)c1O
InChI Key InChIKey=WGOHPPXXDNTAIU-UHFFFAOYSA-N
Data  2 EC50
  Tab Delimited (TSV)   2D SDfile   Computed 3D by Vconf -m prep SDfile
Find this compound or compounds like it in BindingDB:
Activity Spreadsheet -- Enzyme Inhibition Constant Data from BindingDB
Found 2 hits for monomerid = 52863
TargetPOsterior Segregation(Caenorhabditis elegans)
Broad Institute
Curated by PubChem BioAssay
LigandPNGBDBM52863(6-Oxo-1,6-dihydro-pyridazine-3-carboxylic acid [1-...)
Affinity DataEC50:  3.17E+4nM. Assay description: Broad Institute: MLPCN maternal gene expression Project ID: 2024 Keywords: Zinc finger, C. elegans, maternal gene expression, RNA-protein interac...
In DepthDetails PCBioAssay
TargetZinc finger protein mex-5(Caenorhabditis elegans)
Broad Institute
Curated by PubChem BioAssay
LigandPNGBDBM52863(6-Oxo-1,6-dihydro-pyridazine-3-carboxylic acid [1-...)
Affinity DataEC50:  1.26E+4nM. Assay description: Broad Institute: MLPCN maternal gene expression Project ID: 2024 Keywords: Zinc finger, C. elegans, maternal gene expression, RNA-protein interac...
In DepthDetails PCBioAssay