BDBM52869 5-[2-[(E)-(3-methoxy-5-nitro-4-oxidanylidene-cyclohexa-2,5-dien-1-ylidene)methyl]hydrazinyl]-6-methyl-2H-1,2,4-triazin-3-one::5-[2-[(E)-(3-methoxy-5-nitro-4-oxocyclohexa-2,5-dien-1-ylidene)methyl]hydrazinyl]-6-methyl-2H-1,2,4-triazin-3-one::5-[N'-[(E)-(4-keto-3-methoxy-5-nitro-cyclohexa-2,5-dien-1-ylidene)methyl]hydrazino]-6-methyl-2H-1,2,4-triazin-3-one::5-[[(E)-(3-methoxy-5-nitro-4-oxo-1-cyclohexa-2,5-dienylidene)methyl]hydrazo]-6-methyl-2H-1,2,4-triazin-3-one::5-{N'-[1-(4-Hydroxy-3-methoxy-5-nitro-phenyl)-meth-(E)-ylidene]-hydrazino}-6-methyl-2H-[1,2,4]triazin-3- one::MLS000777029::SMR000413418::cid_5710929
SMILES COc1c[c-](C[NH+]=Nc2[nH]c(=O)nnc2C)cc([N+]([O-])=O)c1=O
InChI Key InChIKey=YYMVAXMPAQRFOF-UHFFFAOYSA-O
Data  2 EC50
  Tab Delimited (TSV)   2D SDfile   Computed 3D by Vconf -m prep SDfile
Find this compound or compounds like it in BindingDB:
Activity Spreadsheet -- Enzyme Inhibition Constant Data from BindingDB
Found 2 hits for monomerid = 52869
TargetPOsterior Segregation(Caenorhabditis elegans)
Broad Institute
Curated by PubChem BioAssay
LigandPNGBDBM52869(5-[2-[(E)-(3-methoxy-5-nitro-4-oxidanylidene-cyclo...)
Affinity DataEC50:  7.98E+3nM. Assay description: Broad Institute: MLPCN maternal gene expression Project ID: 2024 Keywords: Zinc finger, C. elegans, maternal gene expression, RNA-protein interac...
In DepthDetails PCBioAssay
TargetZinc finger protein mex-5(Caenorhabditis elegans)
Broad Institute
Curated by PubChem BioAssay
LigandPNGBDBM52869(5-[2-[(E)-(3-methoxy-5-nitro-4-oxidanylidene-cyclo...)
Affinity DataEC50:  1.08E+4nM. Assay description: Broad Institute: MLPCN maternal gene expression Project ID: 2024 Keywords: Zinc finger, C. elegans, maternal gene expression, RNA-protein interac...
In DepthDetails PCBioAssay