BDBM52883 (7-methyl-6,8-dioxo-3-thiophen-3-ylisochromen-7-yl) cyclopentanecarboxylate::CMLD004860::MLS000438862::SMR000452583::[7-methyl-6,8-bis(oxidanylidene)-3-thiophen-3-yl-isochromen-7-yl] cyclopentanecarboxylate::cid_16745548::cyclopentanecarboxylic acid [6,8-diketo-7-methyl-3-(3-thienyl)isochromen-7-yl] ester::cyclopentanecarboxylic acid [7-methyl-6,8-dioxo-3-(3-thiophenyl)-2-benzopyran-7-yl] ester
SMILES CC1(OC(=O)C2CCCC2)C(=O)C=C2C=C(OC=C2C1=O)c1ccsc1
InChI Key InChIKey=PEVUADOTIMGODI-UHFFFAOYSA-N
Data  1 IC50  2 EC50
  Tab Delimited (TSV)   2D SDfile   Computed 3D by Vconf -m prep SDfile
Find this compound or compounds like it in BindingDB:
Activity Spreadsheet -- Enzyme Inhibition Constant Data from BindingDB
Found 3 hits for monomerid = 52883
TargetZinc finger protein mex-5(Caenorhabditis elegans)
Broad Institute
Curated by PubChem BioAssay
LigandPNGBDBM52883((7-methyl-6,8-dioxo-3-thiophen-3-ylisochromen-7-yl...)
Affinity DataEC50:  3.71E+4nM. Assay description: Broad Institute: MLPCN maternal gene expression Project ID: 2024 Keywords: Zinc finger, C. elegans, maternal gene expression, RNA-protein interac...
In DepthDetails PCBioAssay
TargetHuntingtin(Homo sapiens (Human))
The Scripps Research Institute Molecular Screening Center
Curated by PubChem BioAssay
LigandPNGBDBM52883((7-methyl-6,8-dioxo-3-thiophen-3-ylisochromen-7-yl...)
Affinity DataIC50:  8.57E+3nM
In DepthDetails PCBioAssay
TargetPOsterior Segregation(Caenorhabditis elegans)
Broad Institute
Curated by PubChem BioAssay
LigandPNGBDBM52883((7-methyl-6,8-dioxo-3-thiophen-3-ylisochromen-7-yl...)
Affinity DataEC50:  4.78E+4nM. Assay description: Broad Institute: MLPCN maternal gene expression Project ID: 2024 Keywords: Zinc finger, C. elegans, maternal gene expression, RNA-protein interac...
In DepthDetails PCBioAssay