BDBM52974 4-O-(3-butyl-7-methyl-6,8-dioxoisochromen-7-yl) 1-O-methyl butanedioate::CMLD003369::MLS000438322::O4-[3-butyl-7-methyl-6,8-bis(oxidanylidene)isochromen-7-yl] O1-methyl butanedioate::SMR000452564::butanedioic acid O4-(3-butyl-7-methyl-6,8-dioxo-2-benzopyran-7-yl) ester O1-methyl ester::cid_16759447::succinic acid O4-(3-butyl-6,8-diketo-7-methyl-isochromen-7-yl) ester O1-methyl ester
SMILES CCCCC1=CC2=CC(=O)C(C)(OC(=O)CCC(=O)OC)C(=O)C2=CO1
InChI Key InChIKey=GKOXNCCRDMDZRS-UHFFFAOYSA-N
Data  2 EC50
  Tab Delimited (TSV)   2D SDfile   Computed 3D by Vconf -m prep SDfile
Find this compound or compounds like it in BindingDB:
Activity Spreadsheet -- Enzyme Inhibition Constant Data from BindingDB
Found 2 hits for monomerid = 52974
TargetZinc finger protein mex-5(Caenorhabditis elegans)
Broad Institute
Curated by PubChem BioAssay
LigandPNGBDBM52974(4-O-(3-butyl-7-methyl-6,8-dioxoisochromen-7-yl) 1-...)
Affinity DataEC50:  2.66E+4nM. Assay description: Broad Institute: MLPCN maternal gene expression Project ID: 2024 Keywords: Zinc finger, C. elegans, maternal gene expression, RNA-protein interac...
In DepthDetails PCBioAssay
TargetPOsterior Segregation(Caenorhabditis elegans)
Broad Institute
Curated by PubChem BioAssay
LigandPNGBDBM52974(4-O-(3-butyl-7-methyl-6,8-dioxoisochromen-7-yl) 1-...)
Affinity DataEC50:  3.00E+4nM. Assay description: Broad Institute: MLPCN maternal gene expression Project ID: 2024 Keywords: Zinc finger, C. elegans, maternal gene expression, RNA-protein interac...
In DepthDetails PCBioAssay