BDBM53126 2-(4-Chloro-phenyl)-6-hydroxy-benzo[de]isoquinoline-1,3-dione::2-(4-chlorophenyl)-6-hydroxy-benzo[de]isoquinoline-1,3-quinone::2-(4-chlorophenyl)-6-hydroxybenzo[de]isoquinoline-1,3-dione::2-(4-chlorophenyl)-6-oxidanyl-benzo[de]isoquinoline-1,3-dione::MLS001204988::SMR000515419::cid_5396293
SMILES Oc1ccc2C(=O)N(C(=O)c3cccc1c23)c1ccc(Cl)cc1
InChI Key InChIKey=AJLGIQNNYJFJPV-UHFFFAOYSA-N
Data  3 IC50  2 EC50
  Tab Delimited (TSV)   2D SDfile   Computed 3D by Vconf -m prep SDfile
Find this compound or compounds like it in BindingDB:
Activity Spreadsheet -- Enzyme Inhibition Constant Data from BindingDB
Found 5 hits for monomerid = 53126
TargetPOsterior Segregation(Caenorhabditis elegans)
Broad Institute
Curated by PubChem BioAssay
LigandPNGBDBM53126(2-(4-Chloro-phenyl)-6-hydroxy-benzo[de]isoquinolin...)
Affinity DataEC50:  7.11E+3nM. Assay description: Broad Institute: MLPCN maternal gene expression Project ID: 2024 Keywords: Zinc finger, C. elegans, maternal gene expression, RNA-protein interac...
In DepthDetails PCBioAssay
TargetZinc finger protein mex-5(Caenorhabditis elegans)
Broad Institute
Curated by PubChem BioAssay
LigandPNGBDBM53126(2-(4-Chloro-phenyl)-6-hydroxy-benzo[de]isoquinolin...)
Affinity DataEC50:  289nM. Assay description: Broad Institute: MLPCN maternal gene expression Project ID: 2024 Keywords: Zinc finger, C. elegans, maternal gene expression, RNA-protein interac...
In DepthDetails PCBioAssay
TargetBeta-lactamase(Pseudomonas aeruginosa)
The Scripps Research Institute Molecular Screening Center
Curated by PubChem BioAssay
LigandPNGBDBM53126(2-(4-Chloro-phenyl)-6-hydroxy-benzo[de]isoquinolin...)
Affinity DataIC50:  1.98E+4nM. Assay description: Source (MLPCN Center Name): The Scripps Research Institute Molecular Screening Center (SRIMSC) Center Affiliation: The Scripps Research Institute (TS...
In DepthDetails PCBioAssay
TargetBeta-lactamase(Salmonella enterica subsp. enterica serovar Choler...)
The Scripps Research Institute Molecular Screening Center
Curated by PubChem BioAssay
LigandPNGBDBM53126(2-(4-Chloro-phenyl)-6-hydroxy-benzo[de]isoquinolin...)
Affinity DataIC50:  7.95E+3nM. Assay description: Source (MLPCN Center Name): The Scripps Research Institute Molecular Screening Center (SRIMSC) Center Affiliation: The Scripps Research Institute (TS...
In DepthDetails PCBioAssay
TargetBeta-lactamase(Pseudomonas aeruginosa)
The Scripps Research Institute Molecular Screening Center
Curated by PubChem BioAssay
LigandPNGBDBM53126(2-(4-Chloro-phenyl)-6-hydroxy-benzo[de]isoquinolin...)
Affinity DataIC50:  1.91E+4nM. Assay description: Source (MLPCN Center Name): The Scripps Research Institute Molecular Screening Center (SRIMSC) Center Affiliation: The Scripps Research Institute (TS...
In DepthDetails PCBioAssay