BDBM53305 1-(brosylamino)-3-[4-(2-pyrimidylsulfamoyl)phenyl]thiourea::1-[(4-bromophenyl)sulfonylamino]-3-[4-(2-pyrimidinylsulfamoyl)phenyl]thiourea::1-[(4-bromophenyl)sulfonylamino]-3-[4-(pyrimidin-2-ylsulfamoyl)phenyl]thiourea::MLS001060616::SMR000666414::cid_2209112
SMILES Brc1ccc(cc1)S(=O)(=O)NNC(=S)Nc1ccc(cc1)S(=O)(=O)Nc1ncccn1
InChI Key InChIKey=CUKWNEIPILAKJK-UHFFFAOYSA-N
Data  2 EC50
  Tab Delimited (TSV)   2D SDfile   Computed 3D by Vconf -m prep SDfile
Find this compound or compounds like it in BindingDB:
Activity Spreadsheet -- Enzyme Inhibition Constant Data from BindingDB
Found 2 hits for monomerid = 53305
TargetZinc finger protein mex-5(Caenorhabditis elegans)
Broad Institute
Curated by PubChem BioAssay
LigandPNGBDBM53305(1-(brosylamino)-3-[4-(2-pyrimidylsulfamoyl)phenyl]...)
Affinity DataEC50:  5.04E+3nM. Assay description: Broad Institute: MLPCN maternal gene expression Project ID: 2024 Keywords: Zinc finger, C. elegans, maternal gene expression, RNA-protein interac...
In DepthDetails PCBioAssay
TargetPOsterior Segregation(Caenorhabditis elegans)
Broad Institute
Curated by PubChem BioAssay
LigandPNGBDBM53305(1-(brosylamino)-3-[4-(2-pyrimidylsulfamoyl)phenyl]...)
Affinity DataEC50:  2.97E+3nM. Assay description: Broad Institute: MLPCN maternal gene expression Project ID: 2024 Keywords: Zinc finger, C. elegans, maternal gene expression, RNA-protein interac...
In DepthDetails PCBioAssay