BDBM53320 2-azanylidene-N-cyclohexyl-1-[2-(4-methoxyphenyl)ethyl]-5-oxidanylidene-dipyrido[1,2-d:3',4'-f]pyrimidine-3-carboxamide::MLS001146200::N-cyclohexyl-2-imino-1-[2-(4-methoxyphenyl)ethyl]-5-oxo-3-dipyrido[1,2-d:3',4'-f]pyrimidinecarboxamide::N-cyclohexyl-2-imino-1-[2-(4-methoxyphenyl)ethyl]-5-oxodipyrido[1,2-d:3',4'-f]pyrimidine-3-carboxamide::N-cyclohexyl-2-imino-5-keto-1-[2-(4-methoxyphenyl)ethyl]dipyrido[1,2-d:3',4'-f]pyrimidine-3-carboxamide::SMR000646879::cid_3723398
SMILES COc1ccc(CCn2c3nc4ccccn4c(=O)c3cc(C(=O)NC3CCCCC3)c2=N)cc1
InChI Key InChIKey=FQZXLEUPQFECLL-UHFFFAOYSA-N
Data  3 IC50  3 EC50
  Tab Delimited (TSV)   2D SDfile   Computed 3D by Vconf -m prep SDfile
Find this compound or compounds like it in BindingDB:
Activity Spreadsheet -- Enzyme Inhibition Constant Data from BindingDB
Found 6 hits for monomerid = 53320
TargetPOsterior Segregation(Caenorhabditis elegans)
Broad Institute
Curated by PubChem BioAssay
LigandPNGBDBM53320(2-azanylidene-N-cyclohexyl-1-[2-(4-methoxyphenyl)e...)
Affinity DataEC50:  2.16E+4nM. Assay description: Broad Institute: MLPCN maternal gene expression Project ID: 2024 Keywords: Zinc finger, C. elegans, maternal gene expression, RNA-protein interac...
In DepthDetails PCBioAssay
TargetZinc finger protein mex-5(Caenorhabditis elegans)
Broad Institute
Curated by PubChem BioAssay
LigandPNGBDBM53320(2-azanylidene-N-cyclohexyl-1-[2-(4-methoxyphenyl)e...)
Affinity DataEC50:  8.45E+3nM. Assay description: Broad Institute: MLPCN maternal gene expression Project ID: 2024 Keywords: Zinc finger, C. elegans, maternal gene expression, RNA-protein interac...
In DepthDetails PCBioAssay
TargetInterstitial collagenase(Human)
Nanjing University of Chinese Medicine
Curated by ChEMBL
LigandPNGBDBM53320(2-azanylidene-N-cyclohexyl-1-[2-(4-methoxyphenyl)e...)
Affinity DataIC50:  3.25E+3nM. Assay description: Inhibition of human recombinant MMP1 using succinylated gelatin as substrate incubated for 30 mins prior to substrate addition measured after 60 mins
In DepthDetails ArticlePubMed
Target72 kDa type IV collagenase(Human)
Nanjing University of Chinese Medicine
Curated by ChEMBL
LigandPNGBDBM53320(2-azanylidene-N-cyclohexyl-1-[2-(4-methoxyphenyl)e...)
Affinity DataIC50:  9.10nM. Assay description: Inhibition of human recombinant MMP2 using succinylated gelatin as substrate incubated for 30 mins prior to substrate addition measured after 60 mins
In DepthDetails ArticlePubMed
TargetMatrix metalloproteinase-9(Human)
Nanjing University of Chinese Medicine
Curated by ChEMBL
LigandPNGBDBM53320(2-azanylidene-N-cyclohexyl-1-[2-(4-methoxyphenyl)e...)
Affinity DataIC50:  8.20nM. Assay description: Inhibition of human recombinant MMP9 using succinylated gelatin as substrate incubated for 30 mins prior to substrate addition measured after 60 mins
In DepthDetails ArticlePubMed
TargetImportin subunit alpha-1(Human)
Broad Institute
Curated by PubChem BioAssay
LigandPNGBDBM53320(2-azanylidene-N-cyclohexyl-1-[2-(4-methoxyphenyl)e...)
Affinity DataEC50: >5.00E+5nM. Assay description: Keywords: Counterscreen, FRET assay, HTS, YIC probe, Dose response, Assay Overview: This is a fluorescence resonance energy transfer (FRET)-based b...
In DepthDetails PCBioAssay