BDBM53375 (E)-2-cyano-3-[4-(dimethylamino)phenyl]-2-propenoic acid [1-(4-acetamidoanilino)-1-oxopropan-2-yl] ester::(E)-2-cyano-3-[4-(dimethylamino)phenyl]acrylic acid [2-(4-acetamidoanilino)-2-keto-1-methyl-ethyl] ester::MLS001140004::SMR000716778::[1-(4-acetamidoanilino)-1-oxopropan-2-yl] (E)-2-cyano-3-[4-(dimethylamino)phenyl]prop-2-enoate::[1-[(4-acetamidophenyl)amino]-1-oxidanylidene-propan-2-yl] (E)-2-cyano-3-[4-(dimethylamino)phenyl]prop-2-enoate::cid_24686190
SMILES CC(OC(=O)C(=C\c1ccc(cc1)N(C)C)\C#N)C(=O)Nc1ccc(NC(C)=O)cc1
InChI Key InChIKey=ITMISWFOAMINQG-QGOAFFKASA-N
Data  2 IC50  2 EC50
  Tab Delimited (TSV)   2D SDfile   Computed 3D by Vconf -m prep SDfile
Find this compound or compounds like it in BindingDB:
Activity Spreadsheet -- Enzyme Inhibition Constant Data from BindingDB
Found 4 hits for monomerid = 53375
TargetPOsterior Segregation(Caenorhabditis elegans)
Broad Institute
Curated by PubChem BioAssay
LigandPNGBDBM53375((E)-2-cyano-3-[4-(dimethylamino)phenyl]-2-propenoi...)
Affinity DataEC50:  2.69E+4nM. Assay description: Broad Institute: MLPCN maternal gene expression Project ID: 2024 Keywords: Zinc finger, C. elegans, maternal gene expression, RNA-protein interac...
In DepthDetails PCBioAssay
TargetIsoform 2 of Nuclear receptor corepressor 2 (TRAC-1)(Homo sapiens (Human))
The Scripps Research Institute Molecular Screening Center
Curated by PubChem BioAssay
LigandPNGBDBM53375((E)-2-cyano-3-[4-(dimethylamino)phenyl]-2-propenoi...)
Affinity DataIC50: >3.98E+4nM. Assay description: Source (MLPCN Center Name): The Scripps Research Institute Molecular Screening Center Affiliation: The Scripps Research Institute, TSRI Assay Provide...
In DepthDetails PCBioAssay
TargetPhotoreceptor-specific nuclear receptor(Homo sapiens (Human))
The Scripps Research Institute Molecular Screening Center
Curated by PubChem BioAssay
LigandPNGBDBM53375((E)-2-cyano-3-[4-(dimethylamino)phenyl]-2-propenoi...)
Affinity DataIC50: >3.98E+4nM. Assay description: Source (MLPCN Center Name): The Scripps Research Institute Molecular Screening Center Affiliation: The Scripps Research Institute, TSRI Assay Provide...
In DepthDetails PCBioAssay
TargetZinc finger protein mex-5(Caenorhabditis elegans)
Broad Institute
Curated by PubChem BioAssay
LigandPNGBDBM53375((E)-2-cyano-3-[4-(dimethylamino)phenyl]-2-propenoi...)
Affinity DataEC50:  8.63E+4nM. Assay description: Broad Institute: MLPCN maternal gene expression Project ID: 2024 Keywords: Zinc finger, C. elegans, maternal gene expression, RNA-protein interac...
In DepthDetails PCBioAssay