BDBM53429 Acylated oxime isatin derivative, 18::MLS000697580::SMR000470928::cid_5316250::cycloheterophyllin
SMILES [#6]\[#6](-[#6])=[#6]\[#6]-c1c2-[#8]C([#6])([#6])[#6]=[#6]-c2c(-[#8])c2c1oc1-c3cc(-[#8])c(-[#8])cc3-[#8]-[#6](\[#6]=[#6](\[#6])-[#6])-c1c2=O
InChI Key InChIKey=ZZPIXEJZTXAVCX-UHFFFAOYSA-N
Data  1 IC50  1 EC50
  Tab Delimited (TSV)   2D SDfile   Computed 3D by Vconf -m prep SDfile
Find this compound or compounds like it in BindingDB:
Activity Spreadsheet -- Enzyme Inhibition Constant Data from BindingDB
Found 2 hits for monomerid = 53429
TargetStreptokinase A(Streptococcus pyogenes M1 GAS)
Broad Institute
Curated by PubChem BioAssay
LigandPNGBDBM53429(Acylated oxime isatin derivative, 18 | MLS00069758...)
Affinity DataEC50:  1.50E+5nM. Assay description: Keywords: Group A streptococcus, GAS, streptokinase, expression, virulence, inhibition, dose response, EC50 Assay Overview: The goal of this assa...
In DepthDetails PCBioAssay
TargetUbiquitin carboxyl-terminal hydrolase isozyme L1(Mus musculus (Mouse))
Brigham And Women'S Hospital
LigandPNGBDBM53429(Acylated oxime isatin derivative, 18 | MLS00069758...)
Affinity DataIC50:  1.20E+4nMpH: 7.6 T: 2°C. Assay description: Inhibition activity and selectivity for UCH-L1 and UCH-L3.
In DepthDetails ArticlePubMed