BDBM53482 1-Butyl-4-hydroxy-2-oxo-1,2-dihydro-quinoline-3-carboxylic acid 2-chloro-benzylamide::1-butyl-N-(2-chlorobenzyl)-2-hydroxy-4-keto-quinoline-3-carboxamide::1-butyl-N-[(2-chlorophenyl)methyl]-2-hydroxy-4-oxo-3-quinolinecarboxamide::1-butyl-N-[(2-chlorophenyl)methyl]-2-hydroxy-4-oxoquinoline-3-carboxamide::1-butyl-N-[(2-chlorophenyl)methyl]-2-oxidanyl-4-oxidanylidene-quinoline-3-carboxamide::MLS001202596::O-acyl oxime isatin derivative, 5::SMR000513674::cid_1714016
SMILES CCCCn1c2ccccc2c(O)c(C(=O)NCc2ccccc2Cl)c1=O
InChI Key InChIKey=CSSADDDLUREGQK-UHFFFAOYSA-N
Data  2 IC50  1 EC50
  Tab Delimited (TSV)   2D SDfile   Computed 3D by Vconf -m prep SDfile
Find this compound or compounds like it in BindingDB:
Activity Spreadsheet -- Enzyme Inhibition Constant Data from BindingDB
Found 3 hits for monomerid = 53482
TargetUbiquitin carboxyl-terminal hydrolase isozyme L1(Mus musculus (Mouse))
Brigham And Women'S Hospital
LigandPNGBDBM53482(1-Butyl-4-hydroxy-2-oxo-1,2-dihydro-quinoline-3-ca...)
Affinity DataIC50:  1.70E+4nMpH: 7.6 T: 2°C. Assay description: Inhibition activity and selectivity for UCH-L1 and UCH-L3.
In DepthDetails ArticlePubMed
TargetStreptokinase A(Streptococcus pyogenes M1 GAS)
Broad Institute
Curated by PubChem BioAssay
LigandPNGBDBM53482(1-Butyl-4-hydroxy-2-oxo-1,2-dihydro-quinoline-3-ca...)
Affinity DataEC50:  5.97E+3nM. Assay description: Keywords: Group A streptococcus, GAS, streptokinase, expression, virulence, inhibition, dose response, EC50 Assay Overview: The goal of this assa...
In DepthDetails PCBioAssay
TargetUbiquitin carboxyl-terminal hydrolase isozyme L3(Mus musculus (Mouse))
Brigham And Women'S Hospital
LigandPNGBDBM53482(1-Butyl-4-hydroxy-2-oxo-1,2-dihydro-quinoline-3-ca...)
Affinity DataIC50:  4.10E+4nMpH: 7.6 T: 2°C. Assay description: Inhibition activity and selectivity for UCH-L1 and UCH-L3.
In DepthDetails ArticlePubMed