BDBM53496 2-[5-(4-Chloro-3-methyl-phenoxymethyl)-4-ethyl-4H-[1,2,4]triazol-3-ylsulfanyl]-1-pyrrolidin-1-yl-ethanone::2-[[5-[(4-chloranyl-3-methyl-phenoxy)methyl]-4-ethyl-1,2,4-triazol-3-yl]sulfanyl]-1-pyrrolidin-1-yl-ethanone::2-[[5-[(4-chloro-3-methyl-phenoxy)methyl]-4-ethyl-1,2,4-triazol-3-yl]thio]-1-pyrrolidino-ethanone::2-[[5-[(4-chloro-3-methylphenoxy)methyl]-4-ethyl-1,2,4-triazol-3-yl]sulfanyl]-1-pyrrolidin-1-ylethanone::2-[[5-[(4-chloro-3-methylphenoxy)methyl]-4-ethyl-1,2,4-triazol-3-yl]thio]-1-(1-pyrrolidinyl)ethanone::MLS000027507::SMR000002131::cid_647076
SMILES CCn1c(COc2ccc(Cl)c(C)c2)nnc1SCC(=O)N1CCCC1
InChI Key InChIKey=PXSMOSNRZTYHMJ-UHFFFAOYSA-N
Data  1 IC50
  Tab Delimited (TSV)   2D SDfile   Computed 3D by Vconf -m prep SDfile
Find this compound or compounds like it in BindingDB:
Activity Spreadsheet -- Enzyme Inhibition Constant Data from BindingDB
Found 1 hit for monomerid = 53496
TargetTyrosine-protein phosphatase non-receptor type 7(Homo sapiens (Human))
Burnham Center For Chemical Genomics
Curated by PubChem BioAssay
LigandPNGBDBM53496(2-[5-(4-Chloro-3-methyl-phenoxymethyl)-4-ethyl-4H-...)
Affinity DataIC50:  1.00E+5nM. Assay description: Data Source: Sanford-Burnham Center for Chemical Genomics (SBCCG) Source Affiliation: Sanford-Burnham Medical Research Institute (SBMRI, San Diego, C...
In DepthDetails PCBioAssay