BDBM53500 2-Methyl-2-phenylamino-propionitrile::2-anilino-2-methyl-propionitrile::2-anilino-2-methylpropanenitrile::2-methyl-2-phenylazanyl-propanenitrile::MLS000035683::SMR000011822::cid_75128
SMILES CC(C)(Nc1ccccc1)C#N
InChI Key InChIKey=NCTOGJVAFQWQOR-UHFFFAOYSA-N
Data  1 IC50
  Tab Delimited (TSV)   2D SDfile   Computed 3D by Vconf -m prep SDfile
Find this compound or compounds like it in BindingDB:
Activity Spreadsheet -- Enzyme Inhibition Constant Data from BindingDB
Found 1 hit for monomerid = 53500
TargetTyrosine-protein phosphatase non-receptor type 7(Homo sapiens (Human))
Burnham Center For Chemical Genomics
Curated by PubChem BioAssay
LigandPNGBDBM53500(2-Methyl-2-phenylamino-propionitrile | 2-anilino-2...)
Affinity DataIC50:  1.00E+5nM. Assay description: Data Source: Sanford-Burnham Center for Chemical Genomics (SBCCG) Source Affiliation: Sanford-Burnham Medical Research Institute (SBMRI, San Diego, C...
In DepthDetails PCBioAssay