BDBM53520 7-methyl-2-(2-thienyl)-1,2,3,5,6,8-hexahydropyrido[2,3]thieno[2,4-d]pyrimidin-4-one::7-methyl-2-thiophen-2-yl-1,2,3,5,6,8-hexahydropyrido[2,3]thieno[2,4-d]pyrimidin-4-one::MLS000037695::SMR000057928::cid_660490
SMILES CN1CCc2c(C1)sc1NC(NC(=O)c21)c1cccs1
InChI Key InChIKey=GIWGUGKYSSLEOP-UHFFFAOYSA-N
Data  1 IC50  2 EC50
  Tab Delimited (TSV)   2D SDfile   Computed 3D by Vconf -m prep SDfile
Find this compound or compounds like it in BindingDB:
Activity Spreadsheet -- Enzyme Inhibition Constant Data from BindingDB
Found 3 hits for monomerid = 53520
TargetTyrosine-protein phosphatase non-receptor type 7(Homo sapiens (Human))
Burnham Center For Chemical Genomics
Curated by PubChem BioAssay
LigandPNGBDBM53520(7-methyl-2-(2-thienyl)-1,2,3,5,6,8-hexahydropyrido...)
Affinity DataIC50:  1.00E+5nM. Assay description: Data Source: Sanford-Burnham Center for Chemical Genomics (SBCCG) Source Affiliation: Sanford-Burnham Medical Research Institute (SBMRI, San Diego, C...
In DepthDetails PCBioAssay
TargetCorticotropin-releasing factor-binding protein(Homo sapiens (Human))
Burnham Center For Chemical Genomics
Curated by PubChem BioAssay
LigandPNGBDBM53520(7-methyl-2-(2-thienyl)-1,2,3,5,6,8-hexahydropyrido...)
Affinity DataEC50: >5.30E+4nM. Assay description: Data Source: Sanford-Burnham Center for Chemical Genomics (SBCCG) Source Affiliation: Sanford-Burnham Medical Research Institute (SBMRI, San Diego, C...
In DepthDetails PCBioAssay
TargetGlycogen synthase kinase-3 beta(Homo sapiens (Human))
Broad Institute
Curated by PubChem BioAssay
LigandPNGBDBM53520(7-methyl-2-(2-thienyl)-1,2,3,5,6,8-hexahydropyrido...)
Affinity DataEC50: >3.00E+5nM. Assay description: Keywords: GSK3beta, dose response, kinase, inhibition, HTS Assay Overview: The glycogen synthase kinase-3 beta (GSK-3b) is a known master regulator f...
In DepthDetails PCBioAssay