BDBM53591 1-(3,4-Dimethyl-phenyl)-3-(4H-[1,2,4]triazol-3-ylsulfanyl)-pyrrolidine-2,5-dione::1-(3,4-dimethylphenyl)-3-(1H-1,2,4-triazol-5-ylsulfanyl)pyrrolidine-2,5-dione::1-(3,4-dimethylphenyl)-3-(1H-1,2,4-triazol-5-ylthio)pyrrolidine-2,5-dione::1-(3,4-dimethylphenyl)-3-(1H-1,2,4-triazol-5-ylthio)pyrrolidine-2,5-quinone::MLS000528823::SMR000121298::cid_2873851
SMILES Cc1ccc(cc1C)-n1c(O)cc(Sc2nnc[nH]2)c1O
InChI Key InChIKey=IVEPCCLIYUNNGE-UHFFFAOYSA-N
Data  1 IC50
  Tab Delimited (TSV)   2D SDfile   Computed 3D by Vconf -m prep SDfile
Find this compound or compounds like it in BindingDB:
Activity Spreadsheet -- Enzyme Inhibition Constant Data from BindingDB
Found 1 hit for monomerid = 53591
TargetMannose-6-phosphate isomerase(Homo sapiens (Human))
Sanford-Burnham Center For Chemical Genomics
Curated by PubChem BioAssay
LigandPNGBDBM53591(1-(3,4-Dimethyl-phenyl)-3-(4H-[1,2,4]triazol-3-yls...)
Affinity DataIC50:  5.00E+4nM. Assay description: Data Source: Sanford-Burnham Center for Chemical Genomics (SBCCG) Source Affiliation: Sanford-Burnham Medical Research Institute (SBMRI, San Diego, C...
In DepthDetails PCBioAssay