BDBM53594 (6E)-5-azanylidene-2-methyl-6-[[5-(phenylmethylsulfanyl)furan-2-yl]methylidene]-[1,3,4]thiadiazolo[3,2-a]pyrimidin-7-one::(6E)-5-imino-2-methyl-6-[[5-(phenylmethylthio)-2-furanyl]methylidene]-[1,3,4]thiadiazolo[3,2-a]pyrimidin-7-one::(6E)-6-[(5-benzylsulfanylfuran-2-yl)methylidene]-5-imino-2-methyl-[1,3,4]thiadiazolo[3,2-a]pyrimidin-7-one::(6E)-6-[[5-(benzylthio)-2-furyl]methylene]-5-imino-2-methyl-[1,3,4]thiadiazolo[3,2-a]pyrimidin-7-one::MLS000520430::SMR000130841::cid_9551507
SMILES CC1=NN2C(S1)=NC(=O)\C(=C\c1ccc(SCc3ccccc3)o1)C2=N
InChI Key InChIKey=YFZYUFLNTPSUHR-OGJKRULYSA-N
Data  1 IC50
  Tab Delimited (TSV)   2D SDfile   Computed 3D by Vconf -m prep SDfile
Find this compound or compounds like it in BindingDB:
Activity Spreadsheet -- Enzyme Inhibition Constant Data from BindingDB
Found 1 hit for monomerid = 53594
TargetMannose-6-phosphate isomerase(Homo sapiens (Human))
Sanford-Burnham Center For Chemical Genomics
Curated by PubChem BioAssay
LigandPNGBDBM53594((6E)-5-azanylidene-2-methyl-6-[[5-(phenylmethylsul...)
Affinity DataIC50:  5.00E+4nM. Assay description: Data Source: Sanford-Burnham Center for Chemical Genomics (SBCCG) Source Affiliation: Sanford-Burnham Medical Research Institute (SBMRI, San Diego, C...
In DepthDetails PCBioAssay