BDBM53610 3,4-Dimethoxy-N-[N'-(pyrazine-2-carbonyl)-hydrazinocarbothioyl]-benzamide::3,4-dimethoxy-N-[(pyrazin-2-ylcarbonylamino)carbamothioyl]benzamide::3,4-dimethoxy-N-[(pyrazine-2-carbonylamino)carbamothioyl]benzamide::3,4-dimethoxy-N-[(pyrazinoylamino)thiocarbamoyl]benzamide::3,4-dimethoxy-N-[[[oxo(2-pyrazinyl)methyl]hydrazo]-sulfanylidenemethyl]benzamide::MLS000590203::SMR000219433::cid_1997393
SMILES COc1ccc(cc1OC)C(=O)NC(=S)NNC(=O)c1cnccn1
InChI Key InChIKey=UDICXUBEONZJND-UHFFFAOYSA-N
Data  1 IC50
  Tab Delimited (TSV)   2D SDfile   Computed 3D by Vconf -m prep SDfile
Find this compound or compounds like it in BindingDB:
Activity Spreadsheet -- Enzyme Inhibition Constant Data from BindingDB
Found 1 hit for monomerid = 53610
TargetMannose-6-phosphate isomerase(Homo sapiens (Human))
Sanford-Burnham Center For Chemical Genomics
Curated by PubChem BioAssay
LigandPNGBDBM53610(3,4-Dimethoxy-N-[N'-(pyrazine-2-carbonyl)-hydr...)
Affinity DataIC50:  5.00E+4nM. Assay description: Data Source: Sanford-Burnham Center for Chemical Genomics (SBCCG) Source Affiliation: Sanford-Burnham Medical Research Institute (SBMRI, San Diego, C...
In DepthDetails PCBioAssay