BDBM53625 2,2,2-trifluoro-N-[5-(4-methylphenyl)-6H-1,3,4-thiadiazin-2-yl]acetamide::2,2,2-trifluoro-N-[5-(p-tolyl)-6H-1,3,4-thiadiazin-2-yl]acetamide::2,2,2-tris(fluoranyl)-N-[5-(4-methylphenyl)-6H-1,3,4-thiadiazin-2-yl]ethanamide::MLS000683937::SMR000295687::cid_935194
SMILES Cc1ccc(cc1)C1=NN=C(NC(=O)C(F)(F)F)SC1
InChI Key InChIKey=YAWKVLMARDJGDW-UHFFFAOYSA-N
Data  1 IC50
  Tab Delimited (TSV)   2D SDfile   Computed 3D by Vconf -m prep SDfile
Find this compound or compounds like it in BindingDB:
Activity Spreadsheet -- Enzyme Inhibition Constant Data from BindingDB
Found 1 hit for monomerid = 53625
TargetMannose-6-phosphate isomerase(Homo sapiens (Human))
Sanford-Burnham Center For Chemical Genomics
Curated by PubChem BioAssay
LigandPNGBDBM53625(2,2,2-trifluoro-N-[5-(4-methylphenyl)-6H-1,3,4-thi...)
Affinity DataIC50:  5.00E+4nM. Assay description: Data Source: Sanford-Burnham Center for Chemical Genomics (SBCCG) Source Affiliation: Sanford-Burnham Medical Research Institute (SBMRI, San Diego, C...
In DepthDetails PCBioAssay