BDBM53767 2-(6,7-dichloro-1-hydroxy-3-keto-4H-1,2,4-benzotriazin-2-yl)-5,6,7,8-tetrahydro-4H-cyclohepta[b]thiophene-3-carboxylic acid ethyl ester::2-(6,7-dichloro-1-hydroxy-3-oxo-4H-1,2,4-benzotriazin-2-yl)-5,6,7,8-tetrahydro-4H-cyclohepta[b]thiophene-3-carboxylic acid ethyl ester::MLS000545832::SMR000161036::cid_1801434::ethyl 2-(6,7-dichloro-1-hydroxy-3-oxo-3,4-dihydro-1,2,4-benzotriazin-2(1H)-yl)-5,6,7,8-tetrahydro-4H-cyclohepta[b]thiophene-3-carboxylate::ethyl 2-(6,7-dichloro-1-hydroxy-3-oxo-4H-1,2,4-benzotriazin-2-yl)-5,6,7,8-tetrahydro-4H-cyclohepta[b]thiophene-3-carboxylate::ethyl 2-[6,7-bis(chloranyl)-1-oxidanyl-3-oxidanylidene-4H-1,2,4-benzotriazin-2-yl]-5,6,7,8-tetrahydro-4H-cyclohepta[b]thiophene-3-carboxylate
SMILES CCOC(=O)c1c2CCCCCc2sc1N1N(O)c2cc(Cl)c(Cl)cc2NC1=O
InChI Key InChIKey=WAJJFWLCCUHQFQ-UHFFFAOYSA-N
Data  1 IC50  1 EC50
  Tab Delimited (TSV)   2D SDfile   Computed 3D by Vconf -m prep SDfile
Find this compound or compounds like it in BindingDB:
Activity Spreadsheet -- Enzyme Inhibition Constant Data from BindingDB
Found 2 hits for monomerid = 53767
TargetLarge T antigen(Simian virus 40)
Southern Research Specialized Biocontainment Screening Center
Curated by PubChem BioAssay
LigandPNGBDBM53767(2-(6,7-dichloro-1-hydroxy-3-keto-4H-1,2,4-benzotri...)
Affinity DataEC50:  1.56E+4nM. Assay description: Southern Research's Specialized Biocontainment Screening Center (SRSBSC) Southern Research Institute (Birmingham, Alabama) NIH Molecular Librarie...
In DepthDetails PCBioAssay
TargetM1 family aminopeptidase(Plasmodium falciparum (isolate FcB1 / Columbia))
Srmlsc
Curated by PubChem BioAssay
LigandPNGBDBM53767(2-(6,7-dichloro-1-hydroxy-3-keto-4H-1,2,4-benzotri...)
Affinity DataIC50:  8.17E+4nM. Assay description: Southern Research Molecular Libraries Screening Center (SRMLSC) Southern Research Institute (Birmingham, Alabama) NIH Molecular Libraries Screening...
In DepthDetails PCBioAssay