BDBM53779 2-[(5Z)-4-keto-5-(1-naphthylmethylene)-2-thioxo-thiazolidin-3-yl]-3-phenyl-propionic acid::2-[(5Z)-5-(1-naphthalenylmethylidene)-4-oxo-2-sulfanylidene-3-thiazolidinyl]-3-phenylpropanoic acid::2-[(5Z)-5-(naphthalen-1-ylmethylidene)-4-oxidanylidene-2-sulfanylidene-1,3-thiazolidin-3-yl]-3-phenyl-propanoic acid::2-[(5Z)-5-(naphthalen-1-ylmethylidene)-4-oxo-2-sulfanylidene-1,3-thiazolidin-3-yl]-3-phenylpropanoic acid::2-[5-(1-naphthylmethylene)-4-oxo-2-thioxo-1,3-thiazolidin-3-yl]-3-phenylpropanoic acid::MLS000570430::SMR000193394::cid_5344088
SMILES OC(=O)C(Cc1ccccc1)N1C(=S)S\C(=C/c2cccc3ccccc23)C1=O
InChI Key InChIKey=GYQIRCYVGHOEPR-ZHZULCJRSA-N
Data  4 IC50  1 EC50
  Tab Delimited (TSV)   2D SDfile   Computed 3D by Vconf -m prep SDfile
Find this compound or compounds like it in BindingDB:
Activity Spreadsheet -- Enzyme Inhibition Constant Data from BindingDB
Found 5 hits for monomerid = 53779
TargetNucleotide-binding oligomerization domain-containing protein 2(Homo sapiens (Human))
Burnham Center For Chemical Genomics
Curated by PubChem BioAssay
LigandPNGBDBM53779(2-[(5Z)-4-keto-5-(1-naphthylmethylene)-2-thioxo-th...)
Affinity DataIC50:  1.85E+4nM. Assay description: Data Source: Sanford-Burnham Center for Chemical Genomics (SBCCG) Source Affiliation: Sanford-Burnham Medical Research Institute (SBMRI, San Diego, C...
In DepthDetails PCBioAssay
TargetM1 family aminopeptidase(Plasmodium falciparum (isolate FcB1 / Columbia))
Srmlsc
Curated by PubChem BioAssay
LigandPNGBDBM53779(2-[(5Z)-4-keto-5-(1-naphthylmethylene)-2-thioxo-th...)
Affinity DataIC50:  1.49E+4nM. Assay description: Southern Research Molecular Libraries Screening Center (SRMLSC) Southern Research Institute (Birmingham, Alabama) NIH Molecular Libraries Screening...
In DepthDetails PCBioAssay
TargetTumor necrosis factor(Homo sapiens (Human))
Burnham Center For Chemical Genomics
Curated by PubChem BioAssay
LigandPNGBDBM53779(2-[(5Z)-4-keto-5-(1-naphthylmethylene)-2-thioxo-th...)
Affinity DataIC50:  2.00E+4nM. Assay description: Data Source: Sanford-Burnham Center for Chemical Genomics (SBCCG) Source Affiliation: Sanford-Burnham Medical Research Institute (SBMRI, San Diego, C...
In DepthDetails PCBioAssay
TargetProcathepsin L(Homo sapiens (Human))
The Scripps Research Institute Molecular Screening Center
Curated by PubChem BioAssay
LigandPNGBDBM53779(2-[(5Z)-4-keto-5-(1-naphthylmethylene)-2-thioxo-th...)
Affinity DataIC50:  2.84E+4nM. Assay description: Source (MLPCN Center Name): The Scripps Research Institute Molecular Screening Center Affiliation: The Scripps Research Institute, TSRI Assay Provide...
In DepthDetails PCBioAssay
TargetNucleotide-binding oligomerization domain-containing protein 1(Homo sapiens (Human))
Burnham Center For Chemical Genomics
Curated by PubChem BioAssay
LigandPNGBDBM53779(2-[(5Z)-4-keto-5-(1-naphthylmethylene)-2-thioxo-th...)
Affinity DataEC50:  1.65E+4nM. Assay description: Data Source: Sanford-Burnham Center for Chemical Genomics (SBCCG) Source Affiliation: Sanford-Burnham Medical Research Institute (SBMRI, San Diego, C...
In DepthDetails PCBioAssay