BDBM54190 1-[4-(difluoromethoxy)phenyl]-3-[3-(trifluoromethyl)phenyl]urea::1-[4-[bis(fluoranyl)methoxy]phenyl]-3-[3-(trifluoromethyl)phenyl]urea::MLS000537683::N-[4-(difluoromethoxy)phenyl]-N'-[3-(trifluoromethyl)phenyl]urea::SMR000143875::cid_971803
SMILES FC(F)Oc1ccc(NC(=O)Nc2cccc(c2)C(F)(F)F)cc1
InChI Key InChIKey=LNTNWWHGEMJRFD-UHFFFAOYSA-N
Data  6 IC50  2 EC50
  Tab Delimited (TSV)   2D SDfile   Computed 3D by Vconf -m prep SDfile
Find this compound or compounds like it in BindingDB:
Activity Spreadsheet -- Enzyme Inhibition Constant Data from BindingDB
Found 8 hits for monomerid = 54190
TargetNucleotide-binding oligomerization domain-containing protein 2(Homo sapiens (Human))
Burnham Center For Chemical Genomics
Curated by PubChem BioAssay
LigandPNGBDBM54190(1-[4-(difluoromethoxy)phenyl]-3-[3-(trifluoromethy...)
Affinity DataIC50:  4.14E+3nM. Assay description: Data Source: Sanford-Burnham Center for Chemical Genomics (SBCCG) Source Affiliation: Sanford-Burnham Medical Research Institute (SBMRI, San Diego, C...
In DepthDetails PCBioAssay
TargetNucleotide-binding oligomerization domain-containing protein 1(Homo sapiens (Human))
Burnham Center For Chemical Genomics
Curated by PubChem BioAssay
LigandPNGBDBM54190(1-[4-(difluoromethoxy)phenyl]-3-[3-(trifluoromethy...)
Affinity DataEC50:  8.15E+3nM. Assay description: Data Source: Sanford-Burnham Center for Chemical Genomics (SBCCG) Source Affiliation: Sanford-Burnham Medical Research Institute (SBMRI, San Diego, C...
In DepthDetails PCBioAssay
TargetStreptokinase A(Streptococcus pyogenes M1 GAS)
Broad Institute
Curated by PubChem BioAssay
LigandPNGBDBM54190(1-[4-(difluoromethoxy)phenyl]-3-[3-(trifluoromethy...)
Affinity DataEC50:  1.50E+5nM. Assay description: Keywords: Group A streptococcus, GAS, streptokinase, expression, virulence, inhibition, dose response, EC50 Assay Overview: The goal of this assa...
In DepthDetails PCBioAssay
TargetRecBCD enzyme subunit RecD(Escherichia coli str. K-12 substr. MG1655)
The Scripps Research Institute Molecular Screening Center
Curated by PubChem BioAssay
LigandPNGBDBM54190(1-[4-(difluoromethoxy)phenyl]-3-[3-(trifluoromethy...)
Affinity DataIC50: >1.19E+5nM
In DepthDetails PCBioAssay
TargetDNA damage-inducible transcript 3 protein(Mus musculus)
Emory University
Curated by PubChem BioAssay
LigandPNGBDBM54190(1-[4-(difluoromethoxy)phenyl]-3-[3-(trifluoromethy...)
Affinity DataIC50:  9.20E+3nM. Assay description: NIH Molecular Libraries Screening Centers Network [MLSCN] Emory Chemical Biology Discovery Center in MLSCN Assay provider: Dr. Randal Kaufman, Univer...
In DepthDetails PCBioAssay
TargetX-box-binding protein 1(Homo sapiens (Human))
Emory University
Curated by PubChem BioAssay
LigandPNGBDBM54190(1-[4-(difluoromethoxy)phenyl]-3-[3-(trifluoromethy...)
Affinity DataIC50:  1.00E+4nM. Assay description: NIH Molecular Libraries Screening Centers Network [MLSCN] Emory Chemical Biology Discovery Center in MLSCN Assay provider: Dr. Randal Kaufman, Univer...
In DepthDetails PCBioAssay
TargetDNA damage-inducible transcript 3 protein(Mus musculus)
Emory University
Curated by PubChem BioAssay
LigandPNGBDBM54190(1-[4-(difluoromethoxy)phenyl]-3-[3-(trifluoromethy...)
Affinity DataIC50:  9.20E+3nM. Assay description: NIH Molecular Libraries Screening Centers Network [MLSCN] Emory Chemical Biology Discovery Center in MLSCN Assay provider: Dr. Randal Kaufman, Univer...
In DepthDetails PCBioAssay
TargetTumor necrosis factor(Homo sapiens (Human))
Burnham Center For Chemical Genomics
Curated by PubChem BioAssay
LigandPNGBDBM54190(1-[4-(difluoromethoxy)phenyl]-3-[3-(trifluoromethy...)
Affinity DataIC50:  3.04E+3nM. Assay description: Data Source: Sanford-Burnham Center for Chemical Genomics (SBCCG) Source Affiliation: Sanford-Burnham Medical Research Institute (SBMRI, San Diego, C...
In DepthDetails PCBioAssay