BDBM54201 MLS000564029::N-[3-(3-methoxyanilino)-2-quinoxalinyl]-2-thiophenesulfonamide::N-[3-(3-methoxyanilino)quinoxalin-2-yl]thiophene-2-sulfonamide::N-[3-(m-anisidino)quinoxalin-2-yl]thiophene-2-sulfonamide::N-[3-[(3-methoxyphenyl)amino]quinoxalin-2-yl]thiophene-2-sulfonamide::SMR000151588::cid_2309402
SMILES COc1cccc(Nc2nc3ccccc3nc2NS(=O)(=O)c2cccs2)c1
InChI Key InChIKey=VJLWMFCCVNKCMR-UHFFFAOYSA-N
Data  5 IC50  1 EC50
  Tab Delimited (TSV)   2D SDfile   Computed 3D by Vconf -m prep SDfile
Find this compound or compounds like it in BindingDB:
Activity Spreadsheet -- Enzyme Inhibition Constant Data from BindingDB
Found 6 hits for monomerid = 54201
TargetNucleotide-binding oligomerization domain-containing protein 2(Homo sapiens (Human))
Burnham Center For Chemical Genomics
Curated by PubChem BioAssay
LigandPNGBDBM54201(MLS000564029 | N-[3-(3-methoxyanilino)-2-quinoxali...)
Affinity DataIC50:  1.15E+4nM. Assay description: Data Source: Sanford-Burnham Center for Chemical Genomics (SBCCG) Source Affiliation: Sanford-Burnham Medical Research Institute (SBMRI, San Diego, C...
In DepthDetails PCBioAssay
TargetNucleotide-binding oligomerization domain-containing protein 1(Homo sapiens (Human))
Burnham Center For Chemical Genomics
Curated by PubChem BioAssay
LigandPNGBDBM54201(MLS000564029 | N-[3-(3-methoxyanilino)-2-quinoxali...)
Affinity DataEC50:  3.67E+3nM. Assay description: Data Source: Sanford-Burnham Center for Chemical Genomics (SBCCG) Source Affiliation: Sanford-Burnham Medical Research Institute (SBMRI, San Diego, C...
In DepthDetails PCBioAssay
TargetTumor necrosis factor(Homo sapiens (Human))
Burnham Center For Chemical Genomics
Curated by PubChem BioAssay
LigandPNGBDBM54201(MLS000564029 | N-[3-(3-methoxyanilino)-2-quinoxali...)
Affinity DataIC50:  2.00E+4nM. Assay description: Data Source: Sanford-Burnham Center for Chemical Genomics (SBCCG) Source Affiliation: Sanford-Burnham Medical Research Institute (SBMRI, San Diego, C...
In DepthDetails PCBioAssay
TargetNucleotide-binding oligomerization domain-containing protein 2(Homo sapiens (Human))
Burnham Center For Chemical Genomics
Curated by PubChem BioAssay
LigandPNGBDBM54201(MLS000564029 | N-[3-(3-methoxyanilino)-2-quinoxali...)
Affinity DataIC50:  6.08E+3nM. Assay description: Data Source: Sanford-Burnham Center for Chemical Genomics (SBCCG) Source Affiliation: Sanford-Burnham Medical Research Institute (SBMRI, San Diego, C...
In DepthDetails PCBioAssay
TargetTumor necrosis factor(Homo sapiens (Human))
Burnham Center For Chemical Genomics
Curated by PubChem BioAssay
LigandPNGBDBM54201(MLS000564029 | N-[3-(3-methoxyanilino)-2-quinoxali...)
Affinity DataIC50:  1.23E+4nM. Assay description: Data Source: Sanford-Burnham Center for Chemical Genomics (SBCCG) Source Affiliation: Sanford-Burnham Medical Research Institute (SBMRI, San Diego, C...
In DepthDetails PCBioAssay
TargetNucleotide-binding oligomerization domain-containing protein 1(Homo sapiens (Human))
Burnham Center For Chemical Genomics
Curated by PubChem BioAssay
LigandPNGBDBM54201(MLS000564029 | N-[3-(3-methoxyanilino)-2-quinoxali...)
Affinity DataIC50:  4.68E+3nM. Assay description: Data Source: Sanford-Burnham Center for Chemical Genomics (SBCCG) Source Affiliation: Sanford-Burnham Medical Research Institute (SBMRI, San Diego, C...
In DepthDetails PCBioAssay