BDBM54281 2-[2-(N-methylanilino)-2-oxoethoxy]-N-(2-phenoxyethyl)benzamide::2-[2-(methylanilino)-2-oxoethoxy]-N-(2-phenoxyethyl)benzamide::2-[2-[methyl(phenyl)amino]-2-oxidanylidene-ethoxy]-N-(2-phenoxyethyl)benzamide::2-[2-keto-2-(N-methylanilino)ethoxy]-N-(2-phenoxyethyl)benzamide::MLS000702074::SMR000229386::cid_1811598
SMILES CN(C(=O)COc1ccccc1C(=O)NCCOc1ccccc1)c1ccccc1
InChI Key InChIKey=VUXGKEMXGHIQPD-UHFFFAOYSA-N
Data  4 IC50  2 EC50
  Tab Delimited (TSV)   2D SDfile   Computed 3D by Vconf -m prep SDfile
Find this compound or compounds like it in BindingDB:
Activity Spreadsheet -- Enzyme Inhibition Constant Data from BindingDB
Found 6 hits for monomerid = 54281
TargetNucleotide-binding oligomerization domain-containing protein 2(Homo sapiens (Human))
Burnham Center For Chemical Genomics
Curated by PubChem BioAssay
LigandPNGBDBM54281(2-[2-(N-methylanilino)-2-oxoethoxy]-N-(2-phenoxyet...)
Affinity DataIC50:  4.32E+3nM. Assay description: Data Source: Sanford-Burnham Center for Chemical Genomics (SBCCG) Source Affiliation: Sanford-Burnham Medical Research Institute (SBMRI, San Diego, C...
In DepthDetails PCBioAssay
TargetNucleotide-binding oligomerization domain-containing protein 1(Homo sapiens (Human))
Burnham Center For Chemical Genomics
Curated by PubChem BioAssay
LigandPNGBDBM54281(2-[2-(N-methylanilino)-2-oxoethoxy]-N-(2-phenoxyet...)
Affinity DataEC50:  5.76E+3nM. Assay description: Data Source: Sanford-Burnham Center for Chemical Genomics (SBCCG) Source Affiliation: Sanford-Burnham Medical Research Institute (SBMRI, San Diego, C...
In DepthDetails PCBioAssay
Target1-phosphatidylinositol 4,5-bisphosphate phosphodiesterase beta-3(Homo sapiens (Human))
The Scripps Research Institute Molecular Screening Center
Curated by PubChem BioAssay
LigandPNGBDBM54281(2-[2-(N-methylanilino)-2-oxoethoxy]-N-(2-phenoxyet...)
Affinity DataIC50:  1.22E+5nM. Assay description: Source (MLPCN Center Name): The Scripps Research Institute Molecular Screening Center (SRIMSC) Center Affiliation: The Scripps Research Institute Ass...
In DepthDetails PCBioAssay
TargetNeurotensin receptor type 1(Homo sapiens (Human))
Burnham Center For Chemical Genomics
Curated by PubChem BioAssay
LigandPNGBDBM54281(2-[2-(N-methylanilino)-2-oxoethoxy]-N-(2-phenoxyet...)
Affinity DataEC50:  1.79E+4nM. Assay description: Data Source: Sanford-Burnham Center for Chemical Genomics (SBCCG) Source Affiliation: Sanford-Burnham Medical Research Institute (SBMRI, San Diego, C...
In DepthDetails PCBioAssay
Target1-phosphatidylinositol 4,5-bisphosphate phosphodiesterase gamma-1 [1-999,I813T](Homo sapiens (Human))
The Scripps Research Institute Molecular Screening Center
Curated by PubChem BioAssay
LigandPNGBDBM54281(2-[2-(N-methylanilino)-2-oxoethoxy]-N-(2-phenoxyet...)
Affinity DataIC50:  1.22E+5nM. Assay description: Source (MLPCN Center Name): The Scripps Research Institute Molecular Screening Center (SRIMSC) Center Affiliation: The Scripps Research Institute Ass...
In DepthDetails PCBioAssay
TargetTumor necrosis factor(Homo sapiens (Human))
Burnham Center For Chemical Genomics
Curated by PubChem BioAssay
LigandPNGBDBM54281(2-[2-(N-methylanilino)-2-oxoethoxy]-N-(2-phenoxyet...)
Affinity DataIC50:  3.82E+3nM. Assay description: Data Source: Sanford-Burnham Center for Chemical Genomics (SBCCG) Source Affiliation: Sanford-Burnham Medical Research Institute (SBMRI, San Diego, C...
In DepthDetails PCBioAssay