BDBM54341 2-[4-(1,2,4-triazol-1-yl)benzylidene]malonic acid diethyl ester::2-[[4-(1,2,4-triazol-1-yl)phenyl]methylidene]propanedioic acid diethyl ester::MLS000755829::SMR000337502::cid_3767571::diethyl 2-[[4-(1,2,4-triazol-1-yl)phenyl]methylidene]propanedioate::diethyl 2-{[4-(1H-1,2,4-triazol-1-yl)phenyl]methylene}malonate
SMILES [#6]-[#6]-[#8]-[#6](=O)-[#6](=[#6]\c1ccc(cc1)-n1cncn1)\[#6](=O)-[#8]-[#6]-[#6]
InChI Key InChIKey=YTDXXHUOKUOWEB-UHFFFAOYSA-N
Data  2 IC50  1 EC50
  Tab Delimited (TSV)   2D SDfile   Computed 3D by Vconf -m prep SDfile
Find this compound or compounds like it in BindingDB:
Activity Spreadsheet -- Enzyme Inhibition Constant Data from BindingDB
Found 3 hits for monomerid = 54341
TargetNucleotide-binding oligomerization domain-containing protein 2(Homo sapiens (Human))
Burnham Center For Chemical Genomics
Curated by PubChem BioAssay
LigandPNGBDBM54341(2-[4-(1,2,4-triazol-1-yl)benzylidene]malonic acid ...)
Affinity DataIC50:  1.09E+4nM. Assay description: Data Source: Sanford-Burnham Center for Chemical Genomics (SBCCG) Source Affiliation: Sanford-Burnham Medical Research Institute (SBMRI, San Diego, C...
In DepthDetails PCBioAssay
TargetTumor necrosis factor(Homo sapiens (Human))
Burnham Center For Chemical Genomics
Curated by PubChem BioAssay
LigandPNGBDBM54341(2-[4-(1,2,4-triazol-1-yl)benzylidene]malonic acid ...)
Affinity DataIC50:  5.19E+3nM. Assay description: Data Source: Sanford-Burnham Center for Chemical Genomics (SBCCG) Source Affiliation: Sanford-Burnham Medical Research Institute (SBMRI, San Diego, C...
In DepthDetails PCBioAssay
TargetNucleotide-binding oligomerization domain-containing protein 1(Homo sapiens (Human))
Burnham Center For Chemical Genomics
Curated by PubChem BioAssay
LigandPNGBDBM54341(2-[4-(1,2,4-triazol-1-yl)benzylidene]malonic acid ...)
Affinity DataEC50:  2.00E+4nM. Assay description: Data Source: Sanford-Burnham Center for Chemical Genomics (SBCCG) Source Affiliation: Sanford-Burnham Medical Research Institute (SBMRI, San Diego, C...
In DepthDetails PCBioAssay