BDBM54496 MLS001224047::N-Cyclohexyl-2-(5H-[1,2,4]triazino[5,6-b]indol-3-ylsulfanyl)-propionamide::N-cyclohexyl-2-(5H-[1,2,4]triazin[5,6-b]indol-3-ylthio)propionamide::N-cyclohexyl-2-(5H-[1,2,4]triazino[5,6-b]indol-3-ylsulfanyl)propanamide::N-cyclohexyl-2-(5H-[1,2,4]triazino[5,6-b]indol-3-ylthio)propanamide::SMR000607513::cid_24792737
SMILES CC(Sc1nnc2c(n1)[nH]c1ccccc21)C(=O)NC1CCCCC1
InChI Key InChIKey=KMZQDJONJKDSLN-UHFFFAOYSA-N
Data  2 IC50  1 EC50
  Tab Delimited (TSV)   2D SDfile   Computed 3D by Vconf -m prep SDfile
Find this compound or compounds like it in BindingDB:
Activity Spreadsheet -- Enzyme Inhibition Constant Data from BindingDB
Found 3 hits for monomerid = 54496
TargetNucleotide-binding oligomerization domain-containing protein 2(Homo sapiens (Human))
Burnham Center For Chemical Genomics
Curated by PubChem BioAssay
LigandPNGBDBM54496(MLS001224047 | N-Cyclohexyl-2-(5H-[1,2,4]triazino[...)
Affinity DataIC50:  9.89E+3nM. Assay description: Data Source: Sanford-Burnham Center for Chemical Genomics (SBCCG) Source Affiliation: Sanford-Burnham Medical Research Institute (SBMRI, San Diego, C...
In DepthDetails PCBioAssay
TargetTumor necrosis factor(Homo sapiens (Human))
Burnham Center For Chemical Genomics
Curated by PubChem BioAssay
LigandPNGBDBM54496(MLS001224047 | N-Cyclohexyl-2-(5H-[1,2,4]triazino[...)
Affinity DataIC50:  1.11E+4nM. Assay description: Data Source: Sanford-Burnham Center for Chemical Genomics (SBCCG) Source Affiliation: Sanford-Burnham Medical Research Institute (SBMRI, San Diego, C...
In DepthDetails PCBioAssay
TargetNucleotide-binding oligomerization domain-containing protein 1(Homo sapiens (Human))
Burnham Center For Chemical Genomics
Curated by PubChem BioAssay
LigandPNGBDBM54496(MLS001224047 | N-Cyclohexyl-2-(5H-[1,2,4]triazino[...)
Affinity DataEC50:  4.88E+3nM. Assay description: Data Source: Sanford-Burnham Center for Chemical Genomics (SBCCG) Source Affiliation: Sanford-Burnham Medical Research Institute (SBMRI, San Diego, C...
In DepthDetails PCBioAssay