BDBM54503 4-(4-brosylpiperazino)-5,6-dimethyl-thieno[2,3-d]pyrimidine::4-[4-(4-bromophenyl)sulfonyl-1-piperazinyl]-5,6-dimethylthieno[2,3-d]pyrimidine::4-[4-(4-bromophenyl)sulfonylpiperazin-1-yl]-5,6-dimethyl-thieno[2,3-d]pyrimidine::4-[4-(4-bromophenyl)sulfonylpiperazin-1-yl]-5,6-dimethylthieno[2,3-d]pyrimidine::MLS001123766::SMR000665876::cid_1186207
SMILES Cc1sc2ncnc(N3CCN(CC3)S(=O)(=O)c3ccc(Br)cc3)c2c1C
InChI Key InChIKey=UAOQDQCSKLQGLH-UHFFFAOYSA-N
Data  2 IC50  1 EC50
  Tab Delimited (TSV)   2D SDfile   Computed 3D by Vconf -m prep SDfile
Find this compound or compounds like it in BindingDB:
Activity Spreadsheet -- Enzyme Inhibition Constant Data from BindingDB
Found 3 hits for monomerid = 54503
TargetNucleotide-binding oligomerization domain-containing protein 2(Homo sapiens (Human))
Burnham Center For Chemical Genomics
Curated by PubChem BioAssay
LigandPNGBDBM54503(4-(4-brosylpiperazino)-5,6-dimethyl-thieno[2,3-d]p...)
Affinity DataIC50:  5.47E+3nM. Assay description: Data Source: Sanford-Burnham Center for Chemical Genomics (SBCCG) Source Affiliation: Sanford-Burnham Medical Research Institute (SBMRI, San Diego, C...
In DepthDetails PCBioAssay
TargetTumor necrosis factor(Homo sapiens (Human))
Burnham Center For Chemical Genomics
Curated by PubChem BioAssay
LigandPNGBDBM54503(4-(4-brosylpiperazino)-5,6-dimethyl-thieno[2,3-d]p...)
Affinity DataIC50:  4.16E+3nM. Assay description: Data Source: Sanford-Burnham Center for Chemical Genomics (SBCCG) Source Affiliation: Sanford-Burnham Medical Research Institute (SBMRI, San Diego, C...
In DepthDetails PCBioAssay
TargetNucleotide-binding oligomerization domain-containing protein 1(Homo sapiens (Human))
Burnham Center For Chemical Genomics
Curated by PubChem BioAssay
LigandPNGBDBM54503(4-(4-brosylpiperazino)-5,6-dimethyl-thieno[2,3-d]p...)
Affinity DataEC50:  4.21E+3nM. Assay description: Data Source: Sanford-Burnham Center for Chemical Genomics (SBCCG) Source Affiliation: Sanford-Burnham Medical Research Institute (SBMRI, San Diego, C...
In DepthDetails PCBioAssay