BDBM54540 MLS001235598::N-(3-chlorophenyl)-2-[6-(2,4-dimethyl-1,3-thiazol-5-yl)pyridazin-3-yl]sulfanyl-ethanamide::N-(3-chlorophenyl)-2-[6-(2,4-dimethyl-1,3-thiazol-5-yl)pyridazin-3-yl]sulfanylacetamide::N-(3-chlorophenyl)-2-[[6-(2,4-dimethyl-5-thiazolyl)-3-pyridazinyl]thio]acetamide::N-(3-chlorophenyl)-2-[[6-(2,4-dimethylthiazol-5-yl)pyridazin-3-yl]thio]acetamide::SMR000807410::cid_7207561
SMILES Cc1nc(C)c(s1)-c1ccc(SCC(=O)Nc2cccc(Cl)c2)nn1
InChI Key InChIKey=ZGGQACKWPNAVJJ-UHFFFAOYSA-N
Data  2 IC50  1 EC50
  Tab Delimited (TSV)   2D SDfile   Computed 3D by Vconf -m prep SDfile
Find this compound or compounds like it in BindingDB:
Activity Spreadsheet -- Enzyme Inhibition Constant Data from BindingDB
Found 3 hits for monomerid = 54540
TargetNucleotide-binding oligomerization domain-containing protein 2(Homo sapiens (Human))
Burnham Center For Chemical Genomics
Curated by PubChem BioAssay
LigandPNGBDBM54540(MLS001235598 | N-(3-chlorophenyl)-2-[6-(2,4-dimeth...)
Affinity DataIC50:  4.58E+3nM. Assay description: Data Source: Sanford-Burnham Center for Chemical Genomics (SBCCG) Source Affiliation: Sanford-Burnham Medical Research Institute (SBMRI, San Diego, C...
In DepthDetails PCBioAssay
TargetTumor necrosis factor(Homo sapiens (Human))
Burnham Center For Chemical Genomics
Curated by PubChem BioAssay
LigandPNGBDBM54540(MLS001235598 | N-(3-chlorophenyl)-2-[6-(2,4-dimeth...)
Affinity DataIC50:  4.18E+3nM. Assay description: Data Source: Sanford-Burnham Center for Chemical Genomics (SBCCG) Source Affiliation: Sanford-Burnham Medical Research Institute (SBMRI, San Diego, C...
In DepthDetails PCBioAssay
TargetNucleotide-binding oligomerization domain-containing protein 1(Homo sapiens (Human))
Burnham Center For Chemical Genomics
Curated by PubChem BioAssay
LigandPNGBDBM54540(MLS001235598 | N-(3-chlorophenyl)-2-[6-(2,4-dimeth...)
Affinity DataEC50:  2.00E+4nM. Assay description: Data Source: Sanford-Burnham Center for Chemical Genomics (SBCCG) Source Affiliation: Sanford-Burnham Medical Research Institute (SBMRI, San Diego, C...
In DepthDetails PCBioAssay