BDBM54718 2-(Cyclopentyl-{2-[5-(5-methyl-furan-2-yl)-tetrazol-2-yl]-acetyl}-amino)-pentanoic acid cyclopentylamide::MLS000072123::N-cyclopentyl-2-[cyclopentyl-[2-[5-(5-methyl-2-furanyl)-2-tetrazolyl]-1-oxoethyl]amino]pentanamide::N-cyclopentyl-2-[cyclopentyl-[2-[5-(5-methyl-2-furyl)tetrazol-2-yl]acetyl]amino]valeramide::N-cyclopentyl-2-[cyclopentyl-[2-[5-(5-methylfuran-2-yl)-1,2,3,4-tetrazol-2-yl]ethanoyl]amino]pentanamide::N-cyclopentyl-2-[cyclopentyl-[2-[5-(5-methylfuran-2-yl)tetrazol-2-yl]acetyl]amino]pentanamide::SMR000002715::cid_651725
SMILES CCCC(N(C1CCCC1)C(=O)Cn1nnc(n1)-c1ccc(C)o1)C(=O)NC1CCCC1
InChI Key InChIKey=NKYGAHUSYUIOCV-UHFFFAOYSA-N
Data  2 IC50
  Tab Delimited (TSV)   2D SDfile   Computed 3D by Vconf -m prep SDfile
Find this compound or compounds like it in BindingDB:
Activity Spreadsheet -- Enzyme Inhibition Constant Data from BindingDB
Found 2 hits for monomerid = 54718
TargetVoltage-dependent N-type calcium channel subunit alpha-1B(Homo sapiens (Human))
Burnham Center For Chemical Genomics
Curated by PubChem BioAssay
LigandPNGBDBM54718(2-(Cyclopentyl-{2-[5-(5-methyl-furan-2-yl)-tetrazo...)
Affinity DataIC50:  221nM. Assay description: Data Source: Data Source: Sanford-Burnham Center for Chemical Genomics (SBCCG) Source Affiliation: Sanford-Burnham Medical Research Institute Network...
In DepthDetails PCBioAssay
TargetAmyloid-beta A4 precursor protein-binding family A member 1(Rattus norvegicus)
Burnham Center For Chemical Genomics
Curated by PubChem BioAssay
LigandPNGBDBM54718(2-(Cyclopentyl-{2-[5-(5-methyl-furan-2-yl)-tetrazo...)
Affinity DataIC50:  4.50E+4nM. Assay description: Data Source: Sanford-Burnham Center for Chemical Genomics (SBCCG) Source Affiliation: Sanford-Burnham Medical Research Institute (SBMRI, San Diego, C...
In DepthDetails PCBioAssay