BDBM54737 3-[4-[(4,6-diketo-2-thioxo-hexahydropyrimidin-5-ylidene)methyl]-3-phenyl-pyrazol-1-yl]propionic acid::3-[4-[(4,6-dioxo-2-sulfanylidene-1,3-diazinan-5-ylidene)methyl]-3-phenyl-1-pyrazolyl]propanoic acid::3-[4-[(4,6-dioxo-2-sulfanylidene-1,3-diazinan-5-ylidene)methyl]-3-phenylpyrazol-1-yl]propanoic acid::3-[4-[[4,6-bis(oxidanylidene)-2-sulfanylidene-1,3-diazinan-5-ylidene]methyl]-3-phenyl-pyrazol-1-yl]propanoic acid::MLS000707577::SMR000241651::cid_2332919
SMILES [#8]-[#6](=O)-[#6]-[#6]-n1cc(\[#6]=[#6]-2\[#6](=O)-[#7]-[#6](=S)-[#7]-[#6]-2=O)c(n1)-c1ccccc1
InChI Key InChIKey=POGNHMHPEPYGAQ-UHFFFAOYSA-N
Data  2 IC50  1 EC50
  Tab Delimited (TSV)   2D SDfile   Computed 3D by Vconf -m prep SDfile
Find this compound or compounds like it in BindingDB:
Activity Spreadsheet -- Enzyme Inhibition Constant Data from BindingDB
Found 3 hits for monomerid = 54737
TargetAmyloid-beta A4 precursor protein-binding family A member 1(Rattus norvegicus)
Burnham Center For Chemical Genomics
Curated by PubChem BioAssay
LigandPNGBDBM54737(3-[4-[(4,6-diketo-2-thioxo-hexahydropyrimidin-5-yl...)
Affinity DataIC50:  1.98E+4nM. Assay description: Data Source: Sanford-Burnham Center for Chemical Genomics (SBCCG) Source Affiliation: Sanford-Burnham Medical Research Institute (SBMRI, San Diego, C...
In DepthDetails PCBioAssay
TargetGlycogen synthase kinase-3 beta(Homo sapiens (Human))
Broad Institute
Curated by PubChem BioAssay
LigandPNGBDBM54737(3-[4-[(4,6-diketo-2-thioxo-hexahydropyrimidin-5-yl...)
Affinity DataEC50: >3.00E+5nM. Assay description: Keywords: GSK3beta, dose response, kinase, inhibition, HTS Assay Overview: The glycogen synthase kinase-3 beta (GSK-3b) is a known master regulator f...
In DepthDetails PCBioAssay
TargetVoltage-dependent N-type calcium channel subunit alpha-1B(Homo sapiens (Human))
Burnham Center For Chemical Genomics
Curated by PubChem BioAssay
LigandPNGBDBM54737(3-[4-[(4,6-diketo-2-thioxo-hexahydropyrimidin-5-yl...)
Affinity DataIC50:  1.31E+4nM. Assay description: Data Source: Data Source: Sanford-Burnham Center for Chemical Genomics (SBCCG) Source Affiliation: Sanford-Burnham Medical Research Institute Network...
In DepthDetails PCBioAssay