BDBM54786 (4-benzyl-1-{[1-(3-methylphenyl)-1H-imidazol-2-yl]methyl}piperidin-4-yl)methanol::MLS000735813::SMR000317377::[1-[[1-(3-methylphenyl)-2-imidazolyl]methyl]-4-(phenylmethyl)-4-piperidinyl]methanol::[1-[[1-(3-methylphenyl)imidazol-2-yl]methyl]-4-(phenylmethyl)piperidin-4-yl]methanol::[4-benzyl-1-[[1-(3-methylphenyl)imidazol-2-yl]methyl]piperidin-4-yl]methanol::[4-benzyl-1-[[1-(m-tolyl)imidazol-2-yl]methyl]-4-piperidyl]methanol::cid_16192384
SMILES Cc1cccc(c1)-n1ccnc1CN1CCC(CO)(Cc2ccccc2)CC1
InChI Key InChIKey=MMIVEZDJGWJOOL-UHFFFAOYSA-N
Data  1 EC50
  Tab Delimited (TSV)   2D SDfile   Computed 3D by Vconf -m prep SDfile
Find this compound or compounds like it in BindingDB:
Activity Spreadsheet -- Enzyme Inhibition Constant Data from BindingDB
Found 1 hit for monomerid = 54786
TargetKappa-type opioid receptor(Homo sapiens (Human))
Burnham Center For Chemical Genomics
Curated by PubChem BioAssay
LigandPNGBDBM54786((4-benzyl-1-{[1-(3-methylphenyl)-1H-imidazol-2-yl]...)
Affinity DataEC50:  4.15E+3nM. Assay description: Data Source: Sanford-Burnham Center for Chemical Genomics (SBCCG) Source Affiliation: Sanford-Burnham Medical Research Institute (SBMRI, San Diego, C...
In DepthDetails PCBioAssay