BDBM5483 6-(cyclopentylmethoxy)-9H-purin-2-amine::CHEMBL271593::O6-Substituted Guanine Deriv. 23
SMILES Nc1nc(OCC2CCCC2)c2[nH]cnc2n1
InChI Key InChIKey=VKTULUQFIRFTDC-UHFFFAOYSA-N
Data  4 IC50
  Tab Delimited (TSV)   2D SDfile   Computed 3D by Vconf -m prep SDfile
Find this compound or compounds like it in BindingDB:
Activity Spreadsheet -- Enzyme Inhibition Constant Data from BindingDB
Found 4 hits for monomerid = 5483
TargetCyclin-dependent kinase 1/G2/mitotic-specific cyclin-B(Marthasterias glacialis (starfish))
University Of Newcastle
LigandPNGBDBM5483(6-(cyclopentylmethoxy)-9H-purin-2-amine | CHEMBL27...)
Affinity DataIC50:  1.50E+4nM. Assay description: The enzyme was assayed with substrate histone H1 in the presence of 12.5 uM ATP/[gamma-32P] ATP. IC50 is the inhibitor concentration, which inhibits ...
In DepthDetails ArticlePubMed
TargetCyclin-dependent kinase/G2/mitotic-specific cyclin- 1(Homo sapiens (Human))
University Of Zurich
Curated by ChEMBL
LigandPNGBDBM5483(6-(cyclopentylmethoxy)-9H-purin-2-amine | CHEMBL27...)
Affinity DataIC50:  1.50E+4nM. Assay description: Inhibition of CDK1/Cyclin B
In DepthDetails ArticlePubMed
TargetMethylated-DNA--protein-cysteine methyltransferase(Homo sapiens (Human))
Newcastle University
Curated by ChEMBL
LigandPNGBDBM5483(6-(cyclopentylmethoxy)-9H-purin-2-amine | CHEMBL27...)
Affinity DataIC50: >1.00E+6nM. Assay description: concentration required to reduce AGT activity to 50% of control rate in HT-29 cell extract.
In DepthDetails ArticlePubMed
TargetCyclin-A2 [171-432]/Cyclin-dependent kinase 2(Homo sapiens (Human))
University Of Newcastle
LigandPNGBDBM5483(6-(cyclopentylmethoxy)-9H-purin-2-amine | CHEMBL27...)
Affinity DataIC50:  2.10E+4nM. Assay description: The enzyme was assayed with substrate histone H1 in the presence of 12.5 uM ATP/[gamma-32P] ATP. IC50 is the inhibitor concentration, which inhibits ...
In DepthDetails ArticlePubMed