BDBM54894 9-carbazolyl-[2-(trifluoromethyl)phenyl]methanone::BRD-K85868893-001-01-1::carbazol-9-yl-[2-(trifluoromethyl)phenyl]methanone::cid_44247472
SMILES FC(F)(F)c1ccccc1C(=O)n1c2ccccc2c2ccccc12
InChI Key InChIKey=KRSWBJXPWZXCPK-UHFFFAOYSA-N
Data  1 EC50
  Tab Delimited (TSV)   2D SDfile   Computed 3D by Vconf -m prep SDfile
Find this compound or compounds like it in BindingDB:
Activity Spreadsheet -- Enzyme Inhibition Constant Data from BindingDB
Found 1 hit for monomerid = 54894
TargetStreptokinase A(Streptococcus pyogenes M1 GAS)
Broad Institute
Curated by PubChem BioAssay
LigandPNGBDBM54894(9-carbazolyl-[2-(trifluoromethyl)phenyl]methanone ...)
Affinity DataEC50:  6.62E+3nM. Assay description: Keywords: Group A streptococcus, GAS, streptokinase, expression, virulence, inhibition, dose response, EC50 Assay Overview: The goal of this assa...
In DepthDetails PCBioAssay