BDBM54949 MLS001149266::N-[1-(4-imidazol-1-ylphenyl)ethyl]-2-(methylthio)benzamide::N-[1-(4-imidazol-1-ylphenyl)ethyl]-2-methylsulfanyl-benzamide::N-[1-(4-imidazol-1-ylphenyl)ethyl]-2-methylsulfanylbenzamide::N-[1-[4-(1-imidazolyl)phenyl]ethyl]-2-(methylthio)benzamide::SMR000688738::cid_24685445
SMILES CSc1ccccc1C(=O)NC(C)c1ccc(cc1)-n1ccnc1
InChI Key InChIKey=ZZJDLMBKELLMPU-UHFFFAOYSA-N
Data  2 IC50
  Tab Delimited (TSV)   2D SDfile   Computed 3D by Vconf -m prep SDfile
Find this compound or compounds like it in BindingDB:
Activity Spreadsheet -- Enzyme Inhibition Constant Data from BindingDB
Found 2 hits for monomerid = 54949
TargetPlectin(Homo sapiens (Human))
Burnham Center For Chemical Genomics
Curated by PubChem BioAssay
LigandPNGBDBM54949(MLS001149266 | N-[1-(4-imidazol-1-ylphenyl)ethyl]-...)
Affinity DataIC50:  2.00E+5nM. Assay description: Data Source: Sanford-Burnham Center for Chemical Genomics (SBCCG) Source Affiliation: Sanford-Burnham Medical Research Institute (SBMRI, San Diego, C...
In DepthDetails PCBioAssay
TargetPlectin(Homo sapiens (Human))
Burnham Center For Chemical Genomics
Curated by PubChem BioAssay
LigandPNGBDBM54949(MLS001149266 | N-[1-(4-imidazol-1-ylphenyl)ethyl]-...)
Affinity DataIC50:  2.91E+4nM. Assay description: Data Source: Sanford-Burnham Center for Chemical Genomics (SBCCG) Source Affiliation: Sanford-Burnham Medical Research Institute (SBMRI, San Diego, C...
In DepthDetails PCBioAssay