BDBM55001 (E)-3-(5-bromo-2-furanyl)-2-propenoic acid [2-oxo-2-(3-oxo-4H-1,4-benzoxazin-6-yl)ethyl] ester::(E)-3-(5-bromo-2-furyl)acrylic acid [2-keto-2-(3-keto-4H-1,4-benzoxazin-6-yl)ethyl] ester::MLS001142042::SMR000708590::[2-oxidanylidene-2-(3-oxidanylidene-4H-1,4-benzoxazin-6-yl)ethyl] (E)-3-(5-bromanylfuran-2-yl)prop-2-enoate::[2-oxo-2-(3-oxo-4H-1,4-benzoxazin-6-yl)ethyl] (E)-3-(5-bromofuran-2-yl)prop-2-enoate::cid_7868862
SMILES Brc1ccc(C=CC(=O)OCC(=O)c2ccc3OCC(=O)Nc3c2)o1
InChI Key InChIKey=TZJPIPHONMVFLK-UHFFFAOYSA-N
Data  6 IC50
  Tab Delimited (TSV)   2D SDfile   Computed 3D by Vconf -m prep SDfile
Find this compound or compounds like it in BindingDB:
Activity Spreadsheet -- Enzyme Inhibition Constant Data from BindingDB
Found 6 hits for monomerid = 55001
TargetCore protein(Hepatitis C virus)
The Scripps Research Institute Molecular Screening Center
Curated by PubChem BioAssay
LigandPNGBDBM55001((E)-3-(5-bromo-2-furanyl)-2-propenoic acid [2-oxo-...)
Affinity DataIC50: >4.98E+4nM. Assay description: Source (MLPCN Center Name): The Scripps Research Institute Molecular Screening Center Affiliation: The Scripps Research Institute, TSRI Assay Provide...
In DepthDetails PCBioAssay
TargetInduced myeloid leukemia cell differentiation protein Mcl-1(Homo sapiens (Human))
The Scripps Research Institute Molecular Screening Center
Curated by PubChem BioAssay
LigandPNGBDBM55001((E)-3-(5-bromo-2-furanyl)-2-propenoic acid [2-oxo-...)
Affinity DataIC50: >4.03E+3nM. Assay description: Source (MLPCN Center Name): The Scripps Research Institute Molecular Screening Center Affiliation: The Scripps Research Institute, TSRI Assay Provide...
In DepthDetails PCBioAssay
TargetT cell receptor alpha variable 4(Homo sapiens (Human))
The Scripps Research Institute Molecular Screening Center
Curated by PubChem BioAssay
LigandPNGBDBM55001((E)-3-(5-bromo-2-furanyl)-2-propenoic acid [2-oxo-...)
Affinity DataIC50: >9.41E+4nM
In DepthDetails PCBioAssay
TargetDNA (cytosine-5)-methyltransferase 1(Homo sapiens (Human))
Burnham Center For Chemical Genomics
Curated by PubChem BioAssay
LigandPNGBDBM55001((E)-3-(5-bromo-2-furanyl)-2-propenoic acid [2-oxo-...)
Affinity DataIC50:  1.22E+4nM. Assay description: Data Source: Sanford-Burnham Center for Chemical Genomics (SBCCG) Source Affiliation: Sanford-Burnham Medical Research Institute (SBMRI, San Diego, C...
In DepthDetails PCBioAssay
TargetAlbumin(Bos taurus)
The Scripps Research Institute Molecular Screening Center
Curated by PubChem BioAssay
LigandPNGBDBM55001((E)-3-(5-bromo-2-furanyl)-2-propenoic acid [2-oxo-...)
Affinity DataIC50: >9.41E+4nM
In DepthDetails PCBioAssay
TargetBcl-2-like protein 1(Homo sapiens (Human))
The Scripps Research Institute Molecular Screening Center
Curated by PubChem BioAssay
LigandPNGBDBM55001((E)-3-(5-bromo-2-furanyl)-2-propenoic acid [2-oxo-...)
Affinity DataIC50:  1.09E+5nM. Assay description: Source (MLPCN Center Name): The Scripps Research Institute Molecular Screening Center Affiliation: The Scripps Research Institute, TSRI Assay Provide...
In DepthDetails PCBioAssay