BDBM55003 MLS001161521::N-(2-methoxy-5-morpholin-4-ylsulfonyl-phenyl)-3-pyrrol-1-yl-benzamide::N-(2-methoxy-5-morpholin-4-ylsulfonylphenyl)-3-pyrrol-1-ylbenzamide::N-(2-methoxy-5-morpholinosulfonyl-phenyl)-3-pyrrol-1-yl-benzamide::N-[2-methoxy-5-(4-morpholinylsulfonyl)phenyl]-3-(1-pyrrolyl)benzamide::SMR000709766::cid_16314374
SMILES COc1ccc(cc1NC(=O)c1cccc(c1)-n1cccc1)S(=O)(=O)N1CCOCC1
InChI Key InChIKey=NQNBIGTYBJDVBI-UHFFFAOYSA-N
Data  1 IC50
  Tab Delimited (TSV)   2D SDfile   Computed 3D by Vconf -m prep SDfile
Find this compound or compounds like it in BindingDB:
Activity Spreadsheet -- Enzyme Inhibition Constant Data from BindingDB
Found 1 hit for monomerid = 55003
TargetCore protein(Hepatitis C virus)
The Scripps Research Institute Molecular Screening Center
Curated by PubChem BioAssay
LigandPNGBDBM55003(MLS001161521 | N-(2-methoxy-5-morpholin-4-ylsulfon...)
Affinity DataIC50: >4.98E+4nM. Assay description: Source (MLPCN Center Name): The Scripps Research Institute Molecular Screening Center Affiliation: The Scripps Research Institute, TSRI Assay Provide...
In DepthDetails PCBioAssay