BDBM55048 1-[1-(4,5-diphenylthiophen-2-yl)ethylideneamino]thiourea::MLS001207459::SMR000513292::The compound has not trivial name.::[1-(4,5-diphenyl-2-thienyl)ethylideneamino]thiourea::[1-(4,5-diphenyl-2-thiophenyl)ethylideneamino]thiourea::[1-(4,5-diphenylthiophen-2-yl)ethylideneamino]thiourea::cid_1149090
SMILES CC(=NNC(N)=S)c1cc(c(s1)-c1ccccc1)-c1ccccc1
InChI Key InChIKey=KSUUNRFHOPONSZ-UHFFFAOYSA-N
Data  1 IC50
  Tab Delimited (TSV)   2D SDfile   Computed 3D by Vconf -m prep SDfile
Find this compound or compounds like it in BindingDB:
Activity Spreadsheet -- Enzyme Inhibition Constant Data from BindingDB
Found 1 hit for monomerid = 55048
TargetGenome polyprotein(Hepatitis C virus)
The Scripps Research Institute Molecular Screening Center
Curated by PubChem BioAssay
LigandPNGBDBM55048(1-[1-(4,5-diphenylthiophen-2-yl)ethylideneamino]th...)
Affinity DataIC50:  7.78E+3nM. Assay description: Source (MLPCN Center Name): The Scripps Research Institute Molecular Screening Center (SRIMSC) Center Affiliation: The Scripps Research Institute (TS...
In DepthDetails PCBioAssay