BDBM55125 1-(6-morpholin-4-ylpyrimidin-4-yl)-3-[2-(trifluoromethyl)-1,3-benzodioxol-2-yl]urea::1-(6-morpholinopyrimidin-4-yl)-3-[2-(trifluoromethyl)-1,3-benzodioxol-2-yl]urea::1-[6-(4-morpholinyl)-4-pyrimidinyl]-3-[2-(trifluoromethyl)-1,3-benzodioxol-2-yl]urea::MLS000547083::N-[6-(4-morpholinyl)-4-pyrimidinyl]-N'-[2-(trifluoromethyl)-1,3-benzodioxol-2-yl]urea::SMR000115708::cid_993371
SMILES FC(F)(F)C1(NC(=O)Nc2cc(ncn2)N2CCOCC2)Oc2ccccc2O1
InChI Key InChIKey=KPYMUIGOLOGEBW-UHFFFAOYSA-N
Data  2 IC50
  Tab Delimited (TSV)   2D SDfile   Computed 3D by Vconf -m prep SDfile
Find this compound or compounds like it in BindingDB:
Activity Spreadsheet -- Enzyme Inhibition Constant Data from BindingDB
Found 2 hits for monomerid = 55125
TargetProcathepsin L(Homo sapiens (Human))
The Scripps Research Institute Molecular Screening Center
Curated by PubChem BioAssay
LigandPNGBDBM55125(1-(6-morpholin-4-ylpyrimidin-4-yl)-3-[2-(trifluoro...)
Affinity DataIC50: >5.96E+4nM. Assay description: Source (MLPCN Center Name): The Scripps Research Institute Molecular Screening Center Affiliation: The Scripps Research Institute, TSRI Assay Provide...
In DepthDetails PCBioAssay
TargetM18 aspartyl aminopeptidase(Plasmodium falciparum 3D7)
The Scripps Research Institute Molecular Screening Center
Curated by PubChem BioAssay
LigandPNGBDBM55125(1-(6-morpholin-4-ylpyrimidin-4-yl)-3-[2-(trifluoro...)
Affinity DataIC50:  2.70E+3nM. Assay description: Source (MLPCN Center Name): The Scripps Research Institute Molecular Screening Center Affiliation: The Scripps Research Institute, TSRI Assay Provide...
In DepthDetails PCBioAssay