BDBM55316 3-methyl-4-oxo-1,5,6,7-tetrahydroindole-2-carboxylic acid propan-2-yl ester::4-keto-3-methyl-1,5,6,7-tetrahydroindole-2-carboxylic acid isopropyl ester::MLS000066422::SMR000081378::cid_866806::isopropyl 3-methyl-4-oxo-4,5,6,7-tetrahydro-1H-indole-2-carboxylate::propan-2-yl 3-methyl-4-oxidanylidene-1,5,6,7-tetrahydroindole-2-carboxylate::propan-2-yl 3-methyl-4-oxo-1,5,6,7-tetrahydroindole-2-carboxylate
SMILES CC(C)OC(=O)c1[nH]c2CCCC(=O)c2c1C
InChI Key InChIKey=CWEVSSWMZSWAGB-UHFFFAOYSA-N
Data  1 IC50
  Tab Delimited (TSV)   2D SDfile   Computed 3D by Vconf -m prep SDfile
Find this compound or compounds like it in BindingDB:
Activity Spreadsheet -- Enzyme Inhibition Constant Data from BindingDB
Found 1 hit for monomerid = 55316
TargetNeutrophil cytosol factor 1 [S99G](Homo sapiens (Human))
Emory University
Curated by PubChem BioAssay
LigandPNGBDBM55316(3-methyl-4-oxo-1,5,6,7-tetrahydroindole-2-carboxyl...)
Affinity DataIC50:  5.00E+4nM. Assay description: NIH Molecular Libraries Screening Centers Network [MLSCN] Emory Chemical Biology Discovery Center in MLSCN Assay provider: Susan Smith, Emory Univers...
In DepthDetails PCBioAssay