BDBM55509 (4Z)-4-[[5-(2-chlorophenyl)-2-furanyl]methylidene]-2-thiophen-2-yl-5-oxazolone::(4Z)-4-[[5-(2-chlorophenyl)-2-furyl]methylene]-2-(2-thienyl)-2-oxazolin-5-one::(4Z)-4-[[5-(2-chlorophenyl)furan-2-yl]methylidene]-2-thiophen-2-yl-1,3-oxazol-5-one::4-{[5-(2-chlorophenyl)-2-furyl]methylene}-2-(2-thienyl)-1,3-oxazol-5(4H)-one::MLS000571645::SMR000193530::cid_1353888
SMILES Clc1ccccc1-c1ccc(\C=C2/N=C(OC2=O)c2cccs2)o1
InChI Key InChIKey=GTCAKQNIVOITLD-UVTDQMKNSA-N
Data  1 IC50
  Tab Delimited (TSV)   2D SDfile   Computed 3D by Vconf -m prep SDfile
Find this compound or compounds like it in BindingDB:
Activity Spreadsheet -- Enzyme Inhibition Constant Data from BindingDB
Found 1 hit for monomerid = 55509
TargetNeutrophil cytosol factor 1 [S99G](Homo sapiens (Human))
Emory University
Curated by PubChem BioAssay
LigandPNGBDBM55509((4Z)-4-[[5-(2-chlorophenyl)-2-furanyl]methylidene]...)
Affinity DataIC50:  3.48E+3nM. Assay description: NIH Molecular Libraries Screening Centers Network [MLSCN] Emory Chemical Biology Discovery Center in MLSCN Assay provider: Susan Smith, Emory Univers...
In DepthDetails PCBioAssay