BDBM55726 1-[2-fluoranyl-5-methyl-4-[(Z)-2-nitroethenyl]phenyl]pyrrolidine::1-[2-fluoro-5-methyl-4-(2-nitrovinyl)phenyl]pyrrolidine::1-[2-fluoro-5-methyl-4-[(Z)-2-nitroethenyl]phenyl]pyrrolidine::1-[2-fluoro-5-methyl-4-[(Z)-2-nitrovinyl]phenyl]pyrrolidine::MLS000624640::SMR000295261::cid_2219218
SMILES Cc1cc(N2CCCC2)c(F)cc1\C=C/[N+]([O-])=O
InChI Key InChIKey=CTHWWNOHSNCVQW-DAXSKMNVSA-N
Data  3 IC50
  Tab Delimited (TSV)   2D SDfile   Computed 3D by Vconf -m prep SDfile
Find this compound or compounds like it in BindingDB:
Activity Spreadsheet -- Enzyme Inhibition Constant Data from BindingDB
Found 3 hits for monomerid = 55726
TargetNeutrophil cytosol factor 1 [S99G](Homo sapiens (Human))
Emory University
Curated by PubChem BioAssay
LigandPNGBDBM55726(1-[2-fluoranyl-5-methyl-4-[(Z)-2-nitroethenyl]phen...)
Affinity DataIC50:  6.50E+3nM. Assay description: NIH Molecular Libraries Screening Centers Network [MLSCN] Emory Chemical Biology Discovery Center in MLSCN Assay provider: Susan Smith, Emory Univers...
In DepthDetails PCBioAssay
Target26S proteasome non-ATPase regulatory subunit 14(Homo sapiens (Human))
Burnham Center For Chemical Genomics
Curated by PubChem BioAssay
LigandPNGBDBM55726(1-[2-fluoranyl-5-methyl-4-[(Z)-2-nitroethenyl]phen...)
Affinity DataIC50:  1.47E+4nM. Assay description: Data Source: Sanford-Burnham Center for Chemical Genomics (SBCCG) Source Affiliation: Sanford Burnham Medical Research Institute (SBMRI, La Jolla, CA...
In DepthDetails PCBioAssay
TargetProthrombin(Bos taurus (Bovine))
Burnham Center For Chemical Genomics
Curated by PubChem BioAssay
LigandPNGBDBM55726(1-[2-fluoranyl-5-methyl-4-[(Z)-2-nitroethenyl]phen...)
Affinity DataIC50:  2.00E+4nM. Assay description: Data Source: Sanford-Burnham Center for Chemical Genomics (SBCCG) Source Affiliation: Sanford Burnham Medical Research Institute (SBMRI, La Jolla, CA...
In DepthDetails PCBioAssay