BDBM55881 2-(3-morpholin-4-ylphenazin-5-ium-5-yl)ethanol;perchlorate::2-(3-morpholinophenazin-5-ium-5-yl)ethanol;perchlorate::2-[3-(4-morpholinyl)-5-phenazin-5-iumyl]ethanol;perchlorate::5-(2-Hydroxy-ethyl)-3-morpholin-4-yl-phenazin-5-ium::MLS000768911::SMR000433661::cid_16682486
SMILES OCCn1c2ccccc2nc2ccc(cc12)=[N+]1CCOCC1
InChI Key InChIKey=GNWBCWMEPWXQGO-UHFFFAOYSA-N
Data  4 IC50  1 EC50
  Tab Delimited (TSV)   2D SDfile   Computed 3D by Vconf -m prep SDfile
Find this compound or compounds like it in BindingDB:
Activity Spreadsheet -- Enzyme Inhibition Constant Data from BindingDB
Found 5 hits for monomerid = 55881
TargetNeutrophil cytosol factor 1 [S99G](Homo sapiens (Human))
Emory University
Curated by PubChem BioAssay
LigandPNGBDBM55881(2-(3-morpholin-4-ylphenazin-5-ium-5-yl)ethanol;per...)
Affinity DataIC50:  390nM. Assay description: NIH Molecular Libraries Screening Centers Network [MLSCN] Emory Chemical Biology Discovery Center in MLSCN Assay provider: Susan Smith, Emory Univers...
In DepthDetails PCBioAssay
TargetCaspase-3(Homo sapiens (Human))
Burnham Center For Chemical Genomics
Curated by PubChem BioAssay
LigandPNGBDBM55881(2-(3-morpholin-4-ylphenazin-5-ium-5-yl)ethanol;per...)
Affinity DataIC50:  1.08E+4nM. Assay description: Data Source: Sanford-Burnham Center for Chemical Genomics (SBCCG) Source Affiliation: Sanford-Burnham Medical Research Institute (SBMRI, San Diego, C...
In DepthDetails PCBioAssay
TargetMitochondrial peptide methionine sulfoxide reductase(Bos taurus)
The Scripps Research Institute Molecular Screening Center
Curated by PubChem BioAssay
LigandPNGBDBM55881(2-(3-morpholin-4-ylphenazin-5-ium-5-yl)ethanol;per...)
Affinity DataEC50:  5.30E+4nM. Assay description: Source (MLPCN Center Name): The Scripps Research Institute Molecular Screening Center (SRIMSC) Affiliation: The Scripps Research Institute, TSRI Assa...
In DepthDetails PCBioAssay
TargetSentrin-specific protease 6(Homo sapiens (Human))
Burnham Center For Chemical Genomics
Curated by PubChem BioAssay
LigandPNGBDBM55881(2-(3-morpholin-4-ylphenazin-5-ium-5-yl)ethanol;per...)
Affinity DataIC50:  8.08E+3nM. Assay description: Data Source: Sanford-Burnham Center for Chemical Genomics (SBCCG) Source Affiliation: Sanford-Burnham Medical Research Institute (SBMRI, San Diego, C...
In DepthDetails PCBioAssay
TargetSentrin-specific protease 8(Homo sapiens (Human))
Burnham Center For Chemical Genomics
Curated by PubChem BioAssay
LigandPNGBDBM55881(2-(3-morpholin-4-ylphenazin-5-ium-5-yl)ethanol;per...)
Affinity DataIC50:  1.70E+4nM. Assay description: Data Source: Sanford-Burnham Center for Chemical Genomics (SBCCG) Source Affiliation: Sanford-Burnham Medical Research Institute (SBMRI, San Diego, C...
In DepthDetails PCBioAssay