BDBM5591 2-N-(3-bromophenyl)-6-(cyclohexylmethoxy)-5-nitrosopyrimidine-2,4-diamine::2-arylamino-pyrimidine deriv. 9a
SMILES Nc1nc(Nc2cccc(Br)c2)nc(OCC2CCCCC2)c1N=O
InChI Key InChIKey=HPMKMPNNTLGDLY-UHFFFAOYSA-N
Data  2 IC50
  Tab Delimited (TSV)   2D SDfile   Computed 3D by Vconf -m prep SDfile
Find this compound or compounds like it in BindingDB:
Activity Spreadsheet -- Enzyme Inhibition Constant Data from BindingDB
Found 2 hits for monomerid = 5591
TargetCyclin-A2 [171-432]/Cyclin-dependent kinase 2(Homo sapiens (Human))
University Of Newcastle
LigandPNGBDBM5591(2-N-(3-bromophenyl)-6-(cyclohexylmethoxy)-5-nitros...)
Affinity DataIC50:  500nMpH: 7.5 T: 2°C. Assay description: The enzyme was assayed with substrate histone H1 in the presence of 12.5 uM ATP/[gamma-32P] ATP. IC50 is the inhibitor concentration, which inhibits ...
In DepthDetails ArticlePubMed
TargetCyclin-dependent kinase 1/G2/mitotic-specific cyclin-B(Marthasterias glacialis (starfish))
University Of Newcastle
LigandPNGBDBM5591(2-N-(3-bromophenyl)-6-(cyclohexylmethoxy)-5-nitros...)
Affinity DataIC50:  800nMpH: 7.5 T: 2°C. Assay description: The enzyme was assayed with substrate histone H1 in the presence of 12.5 uM ATP/[gamma-32P] ATP. IC50 is the inhibitor concentration, which inhibits ...
In DepthDetails ArticlePubMed