BDBM56246 7-(2-ethoxyethyl)-3-methyl-8-(4-morpholinylmethyl)purine-2,6-dione::7-(2-ethoxyethyl)-3-methyl-8-(morpholin-4-ylmethyl)purine-2,6-dione::7-(2-ethoxyethyl)-3-methyl-8-(morpholinomethyl)xanthine::MLS000102372::SMR000016765::cid_5310044
SMILES CCOCCn1c(CN2CCOCC2)nc2n(C)c(=O)[nH]c(=O)c12
InChI Key InChIKey=LGJHDEVXTWFMAY-UHFFFAOYSA-N
Data  1 IC50
  Tab Delimited (TSV)   2D SDfile   Computed 3D by Vconf -m prep SDfile
Find this compound or compounds like it in BindingDB:
Activity Spreadsheet -- Enzyme Inhibition Constant Data from BindingDB
Found 1 hit for monomerid = 56246
TargetKallikrein-5(Homo sapiens (Human))
Pcmd
Curated by PubChem BioAssay
LigandPNGBDBM56246(7-(2-ethoxyethyl)-3-methyl-8-(4-morpholinylmethyl)...)
Affinity DataIC50:  5.00E+4nM. Assay description: Molecular Library Screening Center Network (MLSCN) Penn Center for Molecular Discovery (PCMD) Assay Provider: Scott L. Diamond, University of Pennsy...
In DepthDetails PCBioAssay